{"text_format":"3","workbook":"xlsx","n_sheets":13,"sheets":["ScreenExactAllAll","ScreenBaseAllAll","ScreenArmlesssAllAll","ScreenExactPlacentaAll","ScreenExactCirculationAll","ScreeningValidatedAllAll","CandidateExactAllAll","CandidateExactChorionicBasalAll","AllValidatedAllAll","AllExactPlacentaAll","AllExactCirculationAll","AllExactAllMildSevere","Studies"],"not_rendered":{"charts":8,"images":1,"macros":1},"read":"whole","date_system":"1900"}

{"sheet":"ScreenExactAllAll","index":0,"n_rows":242,"n_cols":6,"rows_kept":242}
["microRNA","Validated?","Candidate?","Cited","Valided Targets","Studies"]
[223,{"$f":"IF(ISERROR(VLOOKUP(A2,AllValidatedAllAll!$A$2:$A$115, 1, FALSE)),\"No\",\"Yes\")","v":"Yes"},{"$f":"IF(ISERROR(VLOOKUP(A2,CandidateExactAllAll!$A$2:$A$84, 1, FALSE)),\"No\",\"Yes\")","v":"Yes"},9,"GZMB, STAT3, E2F1, FOXO1","Betoni et al., 2013, Choi et al., 2013, Guo et al., 2011, Li et al., 2013, Mayor-Lynn et al., 2011, Xu et al., 2014, Yang et al., 2011, Zhao et al., 2014, Zhu et al., 2009"]
[210,{"$f":"IF(ISERROR(VLOOKUP(A3,AllValidatedAllAll!$A$2:$A$115, 1, FALSE)),\"No\",\"Yes\")","v":"Yes"},{"$f":"IF(ISERROR(VLOOKUP(A3,CandidateExactAllAll!$A$2:$A$84, 1, FALSE)),\"No\",\"Yes\")","v":"Yes"},9,"HSD17B1, ISCU, EFNA3, HOXA9","Enquobahrie et al., 2011, Ishibashi et al., 2012, Jiang et al., 2015, Pineles et al., 2007, Ura et al., 2014, Weedon-Fekjær al., 2014, Xu et al., 2014, Zhang et al., 2015, Zhu et al., 2009"]
["518b",{"$f":"IF(ISERROR(VLOOKUP(A4,AllValidatedAllAll!$A$2:$A$115, 1, FALSE)),\"No\",\"Yes\")","v":"Yes"},{"$f":"IF(ISERROR(VLOOKUP(A4,CandidateExactAllAll!$A$2:$A$84, 1, FALSE)),\"No\",\"Yes\")","v":"Yes"},6,"RAP1B, FOXN1","Guo et al., 2011, Li et al., 2013, Mayor-Lynn et al., 2011, Ura et al., 2014, Xu et al., 2014, Zhu et al., 2009"]
["181a",{"$f":"IF(ISERROR(VLOOKUP(A5,AllValidatedAllAll!$A$2:$A$115, 1, FALSE)),\"No\",\"Yes\")","v":"Yes"},{"$f":"IF(ISERROR(VLOOKUP(A5,CandidateExactAllAll!$A$2:$A$84, 1, FALSE)),\"No\",\"Yes\")","v":"Yes"},6,"(5p) BIRC6, (3p) CBX5","Hu et al., 2009, Jiang et al., 2015, Wu et al., 2012, Xu et al., 2014, Zhang et al., 2015, Zhu et al., 2009"]
[584,{"$f":"IF(ISERROR(VLOOKUP(A6,AllValidatedAllAll!$A$2:$A$115, 1, FALSE)),\"No\",\"Yes\")","v":"Yes"},{"$f":"IF(ISERROR(VLOOKUP(A6,CandidateExactAllAll!$A$2:$A$84, 1, FALSE)),\"No\",\"Yes\")","v":"No"},5,"(5p) KPNB1, PURB, CUL2","Enquobahrie et al., 2011, Jiang et al., 2015, Xu et al., 2014, Zhang et al., 2015, Zhu et al., 2009"]
["517c",{"$f":"IF(ISERROR(VLOOKUP(A7,AllValidatedAllAll!$A$2:$A$115, 1, FALSE)),\"No\",\"Yes\")","v":"Yes"},{"$f":"IF(ISERROR(VLOOKUP(A7,CandidateExactAllAll!$A$2:$A$84, 1, FALSE)),\"No\",\"Yes\")","v":"Yes"},5,"Pyk2, (3p) NFIB","Guo et al., 2011, Ishibashi et al., 2012, Li et al., 2013, Yang et al., 2011, Yang et al., 2015"]
[16,{"$f":"IF(ISERROR(VLOOKUP(A8,AllValidatedAllAll!$A$2:$A$115, 1, FALSE)),\"No\",\"Yes\")","v":"Yes"},{"$f":"IF(ISERROR(VLOOKUP(A8,CandidateExactAllAll!$A$2:$A$84, 1, FALSE)),\"No\",\"Yes\")","v":"Yes"},5,"BLC-2, CCNE1","Hu et al., 2009, Wang, Y. et al. 2012, Wu et al., 2012, Zhang et al., 2015, Zhao et al., 2014"]
["18a",{"$f":"IF(ISERROR(VLOOKUP(A9,AllValidatedAllAll!$A$2:$A$115, 1, FALSE)),\"No\",\"Yes\")","v":"Yes"},{"$f":"IF(ISERROR(VLOOKUP(A9,CandidateExactAllAll!$A$2:$A$84, 1, FALSE)),\"No\",\"Yes\")","v":"Yes"},5," TAOK2, (3p) SRF (5p) INADL ","Ishibashi et al., 2012, Li et al., 2013, Xu et al., 2014, Yang et al., 2015, Zhu et al., 2009"]
[363,{"$f":"IF(ISERROR(VLOOKUP(A10,AllValidatedAllAll!$A$2:$A$115, 1, FALSE)),\"No\",\"Yes\")","v":"Yes"},{"$f":"IF(ISERROR(VLOOKUP(A10,CandidateExactAllAll!$A$2:$A$84, 1, FALSE)),\"No\",\"Yes\")","v":"Yes"},4,"(3p) CDKN1A","Betoni et al., 2013, Xu et al., 2014, Zhang et al., 2015, Zhu et al., 2009"]
["126*",{"$f":"IF(ISERROR(VLOOKUP(A11,AllValidatedAllAll!$A$2:$A$115, 1, FALSE)),\"No\",\"Yes\")","v":"No"},{"$f":"IF(ISERROR(VLOOKUP(A11,CandidateExactAllAll!$A$2:$A$84, 1, FALSE)),\"No\",\"Yes\")","v":"No"},4,"(5p) SLC45A3, MYC","Guo et al., 2011, Ishibashi et al., 2012, Yang et al., 2015, Zhu et al., 2009"]
["130a",{"$f":"IF(ISERROR(VLOOKUP(A12,AllValidatedAllAll!$A$2:$A$115, 1, FALSE)),\"No\",\"Yes\")","v":"No"},{"$f":"IF(ISERROR(VLOOKUP(A12,CandidateExactAllAll!$A$2:$A$84, 1, FALSE)),\"No\",\"Yes\")","v":"No"},4,null,"Guo et al., 2011, Li et al., 2013, Wu et al., 2012, Yang et al., 2015"]
["29a",{"$f":"IF(ISERROR(VLOOKUP(A13,AllValidatedAllAll!$A$2:$A$115, 1, FALSE)),\"No\",\"Yes\")","v":"Yes"},{"$f":"IF(ISERROR(VLOOKUP(A13,CandidateExactAllAll!$A$2:$A$84, 1, FALSE)),\"No\",\"Yes\")","v":"Yes"},4,null,"Guo et al., 2011, Li et al., 2013, Yang et al., 2011, Yang et al., 2015"]
["29b",{"$f":"IF(ISERROR(VLOOKUP(A14,AllValidatedAllAll!$A$2:$A$115, 1, FALSE)),\"No\",\"Yes\")","v":"Yes"},{"$f":"IF(ISERROR(VLOOKUP(A14,CandidateExactAllAll!$A$2:$A$84, 1, FALSE)),\"No\",\"Yes\")","v":"Yes"},4,null,"Hu et al., 2009, Li et al., 2013, Wang, Y. et al. 2012, Zhao et al., 2014"]
[335,{"$f":"IF(ISERROR(VLOOKUP(A15,AllValidatedAllAll!$A$2:$A$115, 1, FALSE)),\"No\",\"Yes\")","v":"Yes"},{"$f":"IF(ISERROR(VLOOKUP(A15,CandidateExactAllAll!$A$2:$A$84, 1, FALSE)),\"No\",\"Yes\")","v":"No"},4,null,"Hu et al., 2009, Jiang et al., 2015, Ura et al., 2014, Zhang et al., 2015"]
[126,{"$f":"IF(ISERROR(VLOOKUP(A16,AllValidatedAllAll!$A$2:$A$115, 1, FALSE)),\"No\",\"Yes\")","v":"Yes"},{"$f":"IF(ISERROR(VLOOKUP(A16,CandidateExactAllAll!$A$2:$A$84, 1, FALSE)),\"No\",\"Yes\")","v":"Yes"},4,null,"Hu et al., 2009, Jiang et al., 2015, Ura et al., 2014, Yang et al., 2015"]
["19a",{"$f":"IF(ISERROR(VLOOKUP(A17,AllValidatedAllAll!$A$2:$A$115, 1, FALSE)),\"No\",\"Yes\")","v":"No"},{"$f":"IF(ISERROR(VLOOKUP(A17,CandidateExactAllAll!$A$2:$A$84, 1, FALSE)),\"No\",\"Yes\")","v":"No"},4,null,"Ishibashi et al., 2012, Li et al., 2013, Xu et al., 2014, Zhu et al., 2009"]
[182,{"$f":"IF(ISERROR(VLOOKUP(A18,AllValidatedAllAll!$A$2:$A$115, 1, FALSE)),\"No\",\"Yes\")","v":"No"},{"$f":"IF(ISERROR(VLOOKUP(A18,CandidateExactAllAll!$A$2:$A$84, 1, FALSE)),\"No\",\"Yes\")","v":"No"},4,null,"Jiang et al., 2015, Li et al., 2013, Pineles et al., 2007, Zhang et al., 2015"]
[144,{"$f":"IF(ISERROR(VLOOKUP(A19,AllValidatedAllAll!$A$2:$A$115, 1, FALSE)),\"No\",\"Yes\")","v":"Yes"},{"$f":"IF(ISERROR(VLOOKUP(A19,CandidateExactAllAll!$A$2:$A$84, 1, FALSE)),\"No\",\"Yes\")","v":"Yes"},4,null,"Li et al., 2013, Ura et al., 2014, Wu et al., 2012, Zhu et al., 2009"]
[101,{"$f":"IF(ISERROR(VLOOKUP(A20,AllValidatedAllAll!$A$2:$A$115, 1, FALSE)),\"No\",\"Yes\")","v":"Yes"},{"$f":"IF(ISERROR(VLOOKUP(A20,CandidateExactAllAll!$A$2:$A$84, 1, FALSE)),\"No\",\"Yes\")","v":"No"},3,null,"Betoni et al., 2013, Li et al., 2013, Zhu et al., 2009"]
["26b",{"$f":"IF(ISERROR(VLOOKUP(A21,AllValidatedAllAll!$A$2:$A$115, 1, FALSE)),\"No\",\"Yes\")","v":"Yes"},{"$f":"IF(ISERROR(VLOOKUP(A21,CandidateExactAllAll!$A$2:$A$84, 1, FALSE)),\"No\",\"Yes\")","v":"No"},3,null,"Choi et al., 2013, Hu et al., 2009, Li et al., 2013"]
[25,{"$f":"IF(ISERROR(VLOOKUP(A22,AllValidatedAllAll!$A$2:$A$115, 1, FALSE)),\"No\",\"Yes\")","v":"Yes"},{"$f":"IF(ISERROR(VLOOKUP(A22,CandidateExactAllAll!$A$2:$A$84, 1, FALSE)),\"No\",\"Yes\")","v":"No"},3,null,"Choi et al., 2013, Li et al., 2013, Ura et al., 2014"]
[204,{"$f":"IF(ISERROR(VLOOKUP(A23,AllValidatedAllAll!$A$2:$A$115, 1, FALSE)),\"No\",\"Yes\")","v":"No"},{"$f":"IF(ISERROR(VLOOKUP(A23,CandidateExactAllAll!$A$2:$A$84, 1, FALSE)),\"No\",\"Yes\")","v":"No"},3,null,"Choi et al., 2013, Ura et al., 2014, Zhu et al., 2009"]
[21,{"$f":"IF(ISERROR(VLOOKUP(A24,AllValidatedAllAll!$A$2:$A$115, 1, FALSE)),\"No\",\"Yes\")","v":"No"},{"$f":"IF(ISERROR(VLOOKUP(A24,CandidateExactAllAll!$A$2:$A$84, 1, FALSE)),\"No\",\"Yes\")","v":"No"},3,null,"Choi et al., 2013, Jiang et al., 2015, Li et al., 2013"]
[1,{"$f":"IF(ISERROR(VLOOKUP(A25,AllValidatedAllAll!$A$2:$A$115, 1, FALSE)),\"No\",\"Yes\")","v":"Yes"},{"$f":"IF(ISERROR(VLOOKUP(A25,CandidateExactAllAll!$A$2:$A$84, 1, FALSE)),\"No\",\"Yes\")","v":"No"},3,null,"Enquobahrie et al., 2011, Zhang et al., 2015, Zhu et al., 2009"]
["125b",{"$f":"IF(ISERROR(VLOOKUP(A26,AllValidatedAllAll!$A$2:$A$115, 1, FALSE)),\"No\",\"Yes\")","v":"No"},{"$f":"IF(ISERROR(VLOOKUP(A26,CandidateExactAllAll!$A$2:$A$84, 1, FALSE)),\"No\",\"Yes\")","v":"No"},3,null,"Guo et al., 2011, Li et al., 2013, Yang et al., 2011"]
["518e",{"$f":"IF(ISERROR(VLOOKUP(A27,AllValidatedAllAll!$A$2:$A$115, 1, FALSE)),\"No\",\"Yes\")","v":"No"},{"$f":"IF(ISERROR(VLOOKUP(A27,CandidateExactAllAll!$A$2:$A$84, 1, FALSE)),\"No\",\"Yes\")","v":"No"},3,null,"Guo et al., 2011, Yang et al., 2011, Yang et al., 2015"]
["30d",{"$f":"IF(ISERROR(VLOOKUP(A28,AllValidatedAllAll!$A$2:$A$115, 1, FALSE)),\"No\",\"Yes\")","v":"No"},{"$f":"IF(ISERROR(VLOOKUP(A28,CandidateExactAllAll!$A$2:$A$84, 1, FALSE)),\"No\",\"Yes\")","v":"No"},3,null,"Guo et al., 2011, Mayor-Lynn et al., 2011, Wu et al., 2012"]
[195,{"$f":"IF(ISERROR(VLOOKUP(A29,AllValidatedAllAll!$A$2:$A$115, 1, FALSE)),\"No\",\"Yes\")","v":"Yes"},{"$f":"IF(ISERROR(VLOOKUP(A29,CandidateExactAllAll!$A$2:$A$84, 1, FALSE)),\"No\",\"Yes\")","v":"Yes"},3,null,"Hu et al., 2009, Xu et al., 2014, Zhu et al., 2009"]
["27a",{"$f":"IF(ISERROR(VLOOKUP(A30,AllValidatedAllAll!$A$2:$A$115, 1, FALSE)),\"No\",\"Yes\")","v":"No"},{"$f":"IF(ISERROR(VLOOKUP(A30,CandidateExactAllAll!$A$2:$A$84, 1, FALSE)),\"No\",\"Yes\")","v":"No"},3,null,"Hu et al., 2009, Li et al., 2013, Yang et al., 2015"]
[451,{"$f":"IF(ISERROR(VLOOKUP(A31,AllValidatedAllAll!$A$2:$A$115, 1, FALSE)),\"No\",\"Yes\")","v":"No"},{"$f":"IF(ISERROR(VLOOKUP(A31,CandidateExactAllAll!$A$2:$A$84, 1, FALSE)),\"No\",\"Yes\")","v":"No"},3,null,"Hu et al., 2009, Ishibashi et al., 2012, Li et al., 2013"]
[214,{"$f":"IF(ISERROR(VLOOKUP(A32,AllValidatedAllAll!$A$2:$A$115, 1, FALSE)),\"No\",\"Yes\")","v":"Yes"},{"$f":"IF(ISERROR(VLOOKUP(A32,CandidateExactAllAll!$A$2:$A$84, 1, FALSE)),\"No\",\"Yes\")","v":"Yes"},3,null,"Hu et al., 2009, Xu et al., 2014, Zhao et al., 2014"]
[185,{"$f":"IF(ISERROR(VLOOKUP(A33,AllValidatedAllAll!$A$2:$A$115, 1, FALSE)),\"No\",\"Yes\")","v":"No"},{"$f":"IF(ISERROR(VLOOKUP(A33,CandidateExactAllAll!$A$2:$A$84, 1, FALSE)),\"No\",\"Yes\")","v":"No"},3,null,"Ishibashi et al., 2012, Li et al., 2013, Yang et al., 2011"]
["10b",{"$f":"IF(ISERROR(VLOOKUP(A34,AllValidatedAllAll!$A$2:$A$115, 1, FALSE)),\"No\",\"Yes\")","v":"No"},{"$f":"IF(ISERROR(VLOOKUP(A34,CandidateExactAllAll!$A$2:$A$84, 1, FALSE)),\"No\",\"Yes\")","v":"No"},3,null,"Ishibashi et al., 2012, Zhao et al., 2014, Zhu et al., 2009"]
["519e*",{"$f":"IF(ISERROR(VLOOKUP(A35,AllValidatedAllAll!$A$2:$A$115, 1, FALSE)),\"No\",\"Yes\")","v":"Yes"},{"$f":"IF(ISERROR(VLOOKUP(A35,CandidateExactAllAll!$A$2:$A$84, 1, FALSE)),\"No\",\"Yes\")","v":"Yes"},3,null,"Ishibashi et al., 2012, Xu et al., 2014, Zhu et al., 2009"]
[152,{"$f":"IF(ISERROR(VLOOKUP(A36,AllValidatedAllAll!$A$2:$A$115, 1, FALSE)),\"No\",\"Yes\")","v":"Yes"},{"$f":"IF(ISERROR(VLOOKUP(A36,CandidateExactAllAll!$A$2:$A$84, 1, FALSE)),\"No\",\"Yes\")","v":"No"},3,null,"Jiang et al., 2015, Ura et al., 2014, Zhu et al., 2009"]
[32,{"$f":"IF(ISERROR(VLOOKUP(A37,AllValidatedAllAll!$A$2:$A$115, 1, FALSE)),\"No\",\"Yes\")","v":"No"},{"$f":"IF(ISERROR(VLOOKUP(A37,CandidateExactAllAll!$A$2:$A$84, 1, FALSE)),\"No\",\"Yes\")","v":"No"},3,null,"Jiang et al., 2015, Ura et al., 2014, Zhu et al., 2009"]
["519d",{"$f":"IF(ISERROR(VLOOKUP(A38,AllValidatedAllAll!$A$2:$A$115, 1, FALSE)),\"No\",\"Yes\")","v":"Yes"},{"$f":"IF(ISERROR(VLOOKUP(A38,CandidateExactAllAll!$A$2:$A$84, 1, FALSE)),\"No\",\"Yes\")","v":"Yes"},3,null,"Li et al., 2013, Yang et al., 2011, Yang et al., 2015"]
[221,{"$f":"IF(ISERROR(VLOOKUP(A39,AllValidatedAllAll!$A$2:$A$115, 1, FALSE)),\"No\",\"Yes\")","v":"Yes"},{"$f":"IF(ISERROR(VLOOKUP(A39,CandidateExactAllAll!$A$2:$A$84, 1, FALSE)),\"No\",\"Yes\")","v":"Yes"},3,null,"Li et al., 2013, Wu et al., 2012, Zhao et al., 2014"]
["30a",{"$f":"IF(ISERROR(VLOOKUP(A40,AllValidatedAllAll!$A$2:$A$115, 1, FALSE)),\"No\",\"Yes\")","v":"Yes"},{"$f":"IF(ISERROR(VLOOKUP(A40,CandidateExactAllAll!$A$2:$A$84, 1, FALSE)),\"No\",\"Yes\")","v":"No"},3,null,"Li et al., 2013, Wang, Y. et al. 2012, Zhao et al., 2014"]
[24,{"$f":"IF(ISERROR(VLOOKUP(A41,AllValidatedAllAll!$A$2:$A$115, 1, FALSE)),\"No\",\"Yes\")","v":"Yes"},{"$f":"IF(ISERROR(VLOOKUP(A41,CandidateExactAllAll!$A$2:$A$84, 1, FALSE)),\"No\",\"Yes\")","v":"No"},3,null,"Li et al., 2013, Mayor-Lynn et al., 2011, Wu et al., 2012"]
[638,{"$f":"IF(ISERROR(VLOOKUP(A42,AllValidatedAllAll!$A$2:$A$115, 1, FALSE)),\"No\",\"Yes\")","v":"No"},{"$f":"IF(ISERROR(VLOOKUP(A42,CandidateExactAllAll!$A$2:$A$84, 1, FALSE)),\"No\",\"Yes\")","v":"No"},3,null,"Xu et al., 2014, Zhao et al., 2014, Zhu et al., 2009"]
["542-3p",{"$f":"IF(ISERROR(VLOOKUP(A43,AllValidatedAllAll!$A$2:$A$115, 1, FALSE)),\"No\",\"Yes\")","v":"Yes"},{"$f":"IF(ISERROR(VLOOKUP(A43,CandidateExactAllAll!$A$2:$A$84, 1, FALSE)),\"No\",\"Yes\")","v":"No"},3,null,"Xu et al., 2014, Yang et al., 2011, Zhu et al., 2009"]
["199b-5p",{"$f":"IF(ISERROR(VLOOKUP(A44,AllValidatedAllAll!$A$2:$A$115, 1, FALSE)),\"No\",\"Yes\")","v":"Yes"},{"$f":"IF(ISERROR(VLOOKUP(A44,CandidateExactAllAll!$A$2:$A$84, 1, FALSE)),\"No\",\"Yes\")","v":"Yes"},2,null,"Betoni et al., 2013, Zhao et al., 2014"]
[493,{"$f":"IF(ISERROR(VLOOKUP(A45,AllValidatedAllAll!$A$2:$A$115, 1, FALSE)),\"No\",\"Yes\")","v":"No"},{"$f":"IF(ISERROR(VLOOKUP(A45,CandidateExactAllAll!$A$2:$A$84, 1, FALSE)),\"No\",\"Yes\")","v":"No"},2,null,"Betoni et al., 2013, Mayor-Lynn et al., 2011"]
["140-5p",{"$f":"IF(ISERROR(VLOOKUP(A46,AllValidatedAllAll!$A$2:$A$115, 1, FALSE)),\"No\",\"Yes\")","v":"Yes"},{"$f":"IF(ISERROR(VLOOKUP(A46,CandidateExactAllAll!$A$2:$A$84, 1, FALSE)),\"No\",\"Yes\")","v":"No"},2,null,"Betoni et al., 2013, Zhao et al., 2014"]
["342-3p",{"$f":"IF(ISERROR(VLOOKUP(A47,AllValidatedAllAll!$A$2:$A$115, 1, FALSE)),\"No\",\"Yes\")","v":"Yes"},{"$f":"IF(ISERROR(VLOOKUP(A47,CandidateExactAllAll!$A$2:$A$84, 1, FALSE)),\"No\",\"Yes\")","v":"No"},2,null,"Choi et al., 2013, Wu et al., 2012"]
["296-5p",{"$f":"IF(ISERROR(VLOOKUP(A48,AllValidatedAllAll!$A$2:$A$115, 1, FALSE)),\"No\",\"Yes\")","v":"Yes"},{"$f":"IF(ISERROR(VLOOKUP(A48,CandidateExactAllAll!$A$2:$A$84, 1, FALSE)),\"No\",\"Yes\")","v":"No"},2,null,"Choi et al., 2013, Ura et al., 2014"]
["26a",{"$f":"IF(ISERROR(VLOOKUP(A49,AllValidatedAllAll!$A$2:$A$115, 1, FALSE)),\"No\",\"Yes\")","v":"Yes"},{"$f":"IF(ISERROR(VLOOKUP(A49,CandidateExactAllAll!$A$2:$A$84, 1, FALSE)),\"No\",\"Yes\")","v":"No"},2,null,"Choi et al., 2013, Wu et al., 2012"]
["34c-5p",{"$f":"IF(ISERROR(VLOOKUP(A50,AllValidatedAllAll!$A$2:$A$115, 1, FALSE)),\"No\",\"Yes\")","v":"No"},{"$f":"IF(ISERROR(VLOOKUP(A50,CandidateExactAllAll!$A$2:$A$84, 1, FALSE)),\"No\",\"Yes\")","v":"No"},2,null,"Enquobahrie et al., 2011, Wang, W. et al. 2012"]
[141,{"$f":"IF(ISERROR(VLOOKUP(A51,AllValidatedAllAll!$A$2:$A$115, 1, FALSE)),\"No\",\"Yes\")","v":"Yes"},{"$f":"IF(ISERROR(VLOOKUP(A51,CandidateExactAllAll!$A$2:$A$84, 1, FALSE)),\"No\",\"Yes\")","v":"Yes"},2,null,"Guo et al., 2011, Hu et al., 2009"]
["517a",{"$f":"IF(ISERROR(VLOOKUP(A52,AllValidatedAllAll!$A$2:$A$115, 1, FALSE)),\"No\",\"Yes\")","v":"No"},{"$f":"IF(ISERROR(VLOOKUP(A52,CandidateExactAllAll!$A$2:$A$84, 1, FALSE)),\"No\",\"Yes\")","v":"No"},2,null,"Guo et al., 2011, Mayor-Lynn et al., 2011"]
[22,{"$f":"IF(ISERROR(VLOOKUP(A53,AllValidatedAllAll!$A$2:$A$115, 1, FALSE)),\"No\",\"Yes\")","v":"No"},{"$f":"IF(ISERROR(VLOOKUP(A53,CandidateExactAllAll!$A$2:$A$84, 1, FALSE)),\"No\",\"Yes\")","v":"No"},2,null,"Guo et al., 2011, Ishibashi et al., 2012"]
["29c",{"$f":"IF(ISERROR(VLOOKUP(A54,AllValidatedAllAll!$A$2:$A$115, 1, FALSE)),\"No\",\"Yes\")","v":"No"},{"$f":"IF(ISERROR(VLOOKUP(A54,CandidateExactAllAll!$A$2:$A$84, 1, FALSE)),\"No\",\"Yes\")","v":"No"},2,null,"Guo et al., 2011, Li et al., 2013"]
[149,{"$f":"IF(ISERROR(VLOOKUP(A55,AllValidatedAllAll!$A$2:$A$115, 1, FALSE)),\"No\",\"Yes\")","v":"Yes"},{"$f":"IF(ISERROR(VLOOKUP(A55,CandidateExactAllAll!$A$2:$A$84, 1, FALSE)),\"No\",\"Yes\")","v":"Yes"},2,null,"Guo et al., 2013, Yang et al., 2015"]
["20b",{"$f":"IF(ISERROR(VLOOKUP(A56,AllValidatedAllAll!$A$2:$A$115, 1, FALSE)),\"No\",\"Yes\")","v":"Yes"},{"$f":"IF(ISERROR(VLOOKUP(A56,CandidateExactAllAll!$A$2:$A$84, 1, FALSE)),\"No\",\"Yes\")","v":"Yes"},2,null,"Hu et al., 2009, Wang, W. et al. 2012"]
["520g",{"$f":"IF(ISERROR(VLOOKUP(A57,AllValidatedAllAll!$A$2:$A$115, 1, FALSE)),\"No\",\"Yes\")","v":"No"},{"$f":"IF(ISERROR(VLOOKUP(A57,CandidateExactAllAll!$A$2:$A$84, 1, FALSE)),\"No\",\"Yes\")","v":"No"},2,null,"Hu et al., 2009, Yang et al., 2011"]
["193b",{"$f":"IF(ISERROR(VLOOKUP(A58,AllValidatedAllAll!$A$2:$A$115, 1, FALSE)),\"No\",\"Yes\")","v":"Yes"},{"$f":"IF(ISERROR(VLOOKUP(A58,CandidateExactAllAll!$A$2:$A$84, 1, FALSE)),\"No\",\"Yes\")","v":"Yes"},2,null,"Ishibashi et al., 2012, Xu et al., 2014"]
["144*",{"$f":"IF(ISERROR(VLOOKUP(A59,AllValidatedAllAll!$A$2:$A$115, 1, FALSE)),\"No\",\"Yes\")","v":"No"},{"$f":"IF(ISERROR(VLOOKUP(A59,CandidateExactAllAll!$A$2:$A$84, 1, FALSE)),\"No\",\"Yes\")","v":"No"},2,null,"Ishibashi et al., 2012, Li et al., 2013"]
["590-5p",{"$f":"IF(ISERROR(VLOOKUP(A60,AllValidatedAllAll!$A$2:$A$115, 1, FALSE)),\"No\",\"Yes\")","v":"No"},{"$f":"IF(ISERROR(VLOOKUP(A60,CandidateExactAllAll!$A$2:$A$84, 1, FALSE)),\"No\",\"Yes\")","v":"No"},2,null,"Ishibashi et al., 2012, Zhao et al., 2014"]
["142-3p",{"$f":"IF(ISERROR(VLOOKUP(A61,AllValidatedAllAll!$A$2:$A$115, 1, FALSE)),\"No\",\"Yes\")","v":"No"},{"$f":"IF(ISERROR(VLOOKUP(A61,CandidateExactAllAll!$A$2:$A$84, 1, FALSE)),\"No\",\"Yes\")","v":"No"},2,null,"Ishibashi et al., 2012, Yang et al., 2015"]
["526b",{"$f":"IF(ISERROR(VLOOKUP(A62,AllValidatedAllAll!$A$2:$A$115, 1, FALSE)),\"No\",\"Yes\")","v":"Yes"},{"$f":"IF(ISERROR(VLOOKUP(A62,CandidateExactAllAll!$A$2:$A$84, 1, FALSE)),\"No\",\"Yes\")","v":"Yes"},2,null,"Ishibashi et al., 2012, Mayor-Lynn et al., 2011"]
["20a",{"$f":"IF(ISERROR(VLOOKUP(A63,AllValidatedAllAll!$A$2:$A$115, 1, FALSE)),\"No\",\"Yes\")","v":"Yes"},{"$f":"IF(ISERROR(VLOOKUP(A63,CandidateExactAllAll!$A$2:$A$84, 1, FALSE)),\"No\",\"Yes\")","v":"Yes"},2,null,"Ishibashi et al., 2012, Zhang et al., 2015"]
["146b-5p",{"$f":"IF(ISERROR(VLOOKUP(A64,AllValidatedAllAll!$A$2:$A$115, 1, FALSE)),\"No\",\"Yes\")","v":"No"},{"$f":"IF(ISERROR(VLOOKUP(A64,CandidateExactAllAll!$A$2:$A$84, 1, FALSE)),\"No\",\"Yes\")","v":"No"},2,null,"Ishibashi et al., 2012, Mayor-Lynn et al., 2011"]
["518c",{"$f":"IF(ISERROR(VLOOKUP(A65,AllValidatedAllAll!$A$2:$A$115, 1, FALSE)),\"No\",\"Yes\")","v":"No"},{"$f":"IF(ISERROR(VLOOKUP(A65,CandidateExactAllAll!$A$2:$A$84, 1, FALSE)),\"No\",\"Yes\")","v":"No"},2,null,"Ishibashi et al., 2012, Li et al., 2013"]
[224,{"$f":"IF(ISERROR(VLOOKUP(A66,AllValidatedAllAll!$A$2:$A$115, 1, FALSE)),\"No\",\"Yes\")","v":"No"},{"$f":"IF(ISERROR(VLOOKUP(A66,CandidateExactAllAll!$A$2:$A$84, 1, FALSE)),\"No\",\"Yes\")","v":"No"},2,null,"Ishibashi et al., 2012, Yang et al., 2015"]
[377,{"$f":"IF(ISERROR(VLOOKUP(A67,AllValidatedAllAll!$A$2:$A$115, 1, FALSE)),\"No\",\"Yes\")","v":"Yes"},{"$f":"IF(ISERROR(VLOOKUP(A67,CandidateExactAllAll!$A$2:$A$84, 1, FALSE)),\"No\",\"Yes\")","v":"No"},2,null,"Jiang et al., 2015, Zhu et al., 2009"]
["517b",{"$f":"IF(ISERROR(VLOOKUP(A68,AllValidatedAllAll!$A$2:$A$115, 1, FALSE)),\"No\",\"Yes\")","v":"No"},{"$f":"IF(ISERROR(VLOOKUP(A68,CandidateExactAllAll!$A$2:$A$84, 1, FALSE)),\"No\",\"Yes\")","v":"No"},2,null,"Li et al., 2013, Yang et al., 2011"]
[521,{"$f":"IF(ISERROR(VLOOKUP(A69,AllValidatedAllAll!$A$2:$A$115, 1, FALSE)),\"No\",\"Yes\")","v":"No"},{"$f":"IF(ISERROR(VLOOKUP(A69,CandidateExactAllAll!$A$2:$A$84, 1, FALSE)),\"No\",\"Yes\")","v":"No"},2,null,"Li et al., 2013, Yang et al., 2011"]
[378,{"$f":"IF(ISERROR(VLOOKUP(A70,AllValidatedAllAll!$A$2:$A$115, 1, FALSE)),\"No\",\"Yes\")","v":"No"},{"$f":"IF(ISERROR(VLOOKUP(A70,CandidateExactAllAll!$A$2:$A$84, 1, FALSE)),\"No\",\"Yes\")","v":"No"},2,null,"Li et al., 2013, Mayor-Lynn et al., 2011"]
["519a",{"$f":"IF(ISERROR(VLOOKUP(A71,AllValidatedAllAll!$A$2:$A$115, 1, FALSE)),\"No\",\"Yes\")","v":"Yes"},{"$f":"IF(ISERROR(VLOOKUP(A71,CandidateExactAllAll!$A$2:$A$84, 1, FALSE)),\"No\",\"Yes\")","v":"Yes"},2,null,"Li et al., 2013, Yang et al., 2011"]
["520h",{"$f":"IF(ISERROR(VLOOKUP(A72,AllValidatedAllAll!$A$2:$A$115, 1, FALSE)),\"No\",\"Yes\")","v":"Yes"},{"$f":"IF(ISERROR(VLOOKUP(A72,CandidateExactAllAll!$A$2:$A$84, 1, FALSE)),\"No\",\"Yes\")","v":"Yes"},2,null,"Li et al., 2013, Yang et al., 2011"]
["125a-5p",{"$f":"IF(ISERROR(VLOOKUP(A73,AllValidatedAllAll!$A$2:$A$115, 1, FALSE)),\"No\",\"Yes\")","v":"No"},{"$f":"IF(ISERROR(VLOOKUP(A73,CandidateExactAllAll!$A$2:$A$84, 1, FALSE)),\"No\",\"Yes\")","v":"No"},2,null,"Li et al., 2013, Yang et al., 2011"]
["515-3p",{"$f":"IF(ISERROR(VLOOKUP(A74,AllValidatedAllAll!$A$2:$A$115, 1, FALSE)),\"No\",\"Yes\")","v":"No"},{"$f":"IF(ISERROR(VLOOKUP(A74,CandidateExactAllAll!$A$2:$A$84, 1, FALSE)),\"No\",\"Yes\")","v":"No"},2,null,"Li et al., 2013, Xu et al., 2014"]
[424,{"$f":"IF(ISERROR(VLOOKUP(A75,AllValidatedAllAll!$A$2:$A$115, 1, FALSE)),\"No\",\"Yes\")","v":"No"},{"$f":"IF(ISERROR(VLOOKUP(A75,CandidateExactAllAll!$A$2:$A$84, 1, FALSE)),\"No\",\"Yes\")","v":"No"},2,null,"Li et al., 2013, Zhang et al., 2015"]
[100,{"$f":"IF(ISERROR(VLOOKUP(A76,AllValidatedAllAll!$A$2:$A$115, 1, FALSE)),\"No\",\"Yes\")","v":"Yes"},{"$f":"IF(ISERROR(VLOOKUP(A76,CandidateExactAllAll!$A$2:$A$84, 1, FALSE)),\"No\",\"Yes\")","v":"No"},2,null,"Li et al., 2013, Zhao et al., 2014"]
["99a",{"$f":"IF(ISERROR(VLOOKUP(A77,AllValidatedAllAll!$A$2:$A$115, 1, FALSE)),\"No\",\"Yes\")","v":"No"},{"$f":"IF(ISERROR(VLOOKUP(A77,CandidateExactAllAll!$A$2:$A$84, 1, FALSE)),\"No\",\"Yes\")","v":"No"},2,null,"Li et al., 2013, Zhao et al., 2014"]
[145,{"$f":"IF(ISERROR(VLOOKUP(A78,AllValidatedAllAll!$A$2:$A$115, 1, FALSE)),\"No\",\"Yes\")","v":"No"},{"$f":"IF(ISERROR(VLOOKUP(A78,CandidateExactAllAll!$A$2:$A$84, 1, FALSE)),\"No\",\"Yes\")","v":"No"},2,null,"Li et al., 2013, Wu et al., 2012"]
["19b",{"$f":"IF(ISERROR(VLOOKUP(A79,AllValidatedAllAll!$A$2:$A$115, 1, FALSE)),\"No\",\"Yes\")","v":"Yes"},{"$f":"IF(ISERROR(VLOOKUP(A79,CandidateExactAllAll!$A$2:$A$84, 1, FALSE)),\"No\",\"Yes\")","v":"Yes"},2,null,"Li et al., 2013, Zhang et al., 2015"]
["15b",{"$f":"IF(ISERROR(VLOOKUP(A80,AllValidatedAllAll!$A$2:$A$115, 1, FALSE)),\"No\",\"Yes\")","v":"No"},{"$f":"IF(ISERROR(VLOOKUP(A80,CandidateExactAllAll!$A$2:$A$84, 1, FALSE)),\"No\",\"Yes\")","v":"No"},2,null,"Li et al., 2013, Ura et al., 2014"]
["320c",{"$f":"IF(ISERROR(VLOOKUP(A81,AllValidatedAllAll!$A$2:$A$115, 1, FALSE)),\"No\",\"Yes\")","v":"No"},{"$f":"IF(ISERROR(VLOOKUP(A81,CandidateExactAllAll!$A$2:$A$84, 1, FALSE)),\"No\",\"Yes\")","v":"No"},2,null,"Li et al., 2013, Yang et al., 2011"]
["let-7f",{"$f":"IF(ISERROR(VLOOKUP(A82,AllValidatedAllAll!$A$2:$A$115, 1, FALSE)),\"No\",\"Yes\")","v":"No"},{"$f":"IF(ISERROR(VLOOKUP(A82,CandidateExactAllAll!$A$2:$A$84, 1, FALSE)),\"No\",\"Yes\")","v":"No"},2,null,"Li et al., 2013, Yang et al., 2011"]
["146a",{"$f":"IF(ISERROR(VLOOKUP(A83,AllValidatedAllAll!$A$2:$A$115, 1, FALSE)),\"No\",\"Yes\")","v":"No"},{"$f":"IF(ISERROR(VLOOKUP(A83,CandidateExactAllAll!$A$2:$A$84, 1, FALSE)),\"No\",\"Yes\")","v":"No"},2,null,"Mayor-Lynn et al., 2011, Wang, W. et al. 2012"]
["512-3p",{"$f":"IF(ISERROR(VLOOKUP(A84,AllValidatedAllAll!$A$2:$A$115, 1, FALSE)),\"No\",\"Yes\")","v":"No"},{"$f":"IF(ISERROR(VLOOKUP(A84,CandidateExactAllAll!$A$2:$A$84, 1, FALSE)),\"No\",\"Yes\")","v":"No"},2,null,"Mayor-Lynn et al., 2011, Wang, W. et al. 2012"]
[495,{"$f":"IF(ISERROR(VLOOKUP(A85,AllValidatedAllAll!$A$2:$A$115, 1, FALSE)),\"No\",\"Yes\")","v":"Yes"},{"$f":"IF(ISERROR(VLOOKUP(A85,CandidateExactAllAll!$A$2:$A$84, 1, FALSE)),\"No\",\"Yes\")","v":"No"},2,null,"Mayor-Lynn et al., 2011, Zhao et al., 2014"]
["376a",{"$f":"IF(ISERROR(VLOOKUP(A86,AllValidatedAllAll!$A$2:$A$115, 1, FALSE)),\"No\",\"Yes\")","v":"No"},{"$f":"IF(ISERROR(VLOOKUP(A86,CandidateExactAllAll!$A$2:$A$84, 1, FALSE)),\"No\",\"Yes\")","v":"No"},2,null,"Ura et al., 2014, Zhao et al., 2014"]
["151-3p",{"$f":"IF(ISERROR(VLOOKUP(A87,AllValidatedAllAll!$A$2:$A$115, 1, FALSE)),\"No\",\"Yes\")","v":"No"},{"$f":"IF(ISERROR(VLOOKUP(A87,CandidateExactAllAll!$A$2:$A$84, 1, FALSE)),\"No\",\"Yes\")","v":"No"},2,null,"Wang, W. et al. 2012, Wu et al., 2012"]
["30a-3p",{"$f":"IF(ISERROR(VLOOKUP(A88,AllValidatedAllAll!$A$2:$A$115, 1, FALSE)),\"No\",\"Yes\")","v":"Yes"},{"$f":"IF(ISERROR(VLOOKUP(A88,CandidateExactAllAll!$A$2:$A$84, 1, FALSE)),\"No\",\"Yes\")","v":"Yes"},2,null,"Xu et al., 2014, Zhu et al., 2009"]
[31,{"$f":"IF(ISERROR(VLOOKUP(A89,AllValidatedAllAll!$A$2:$A$115, 1, FALSE)),\"No\",\"Yes\")","v":"No"},{"$f":"IF(ISERROR(VLOOKUP(A89,CandidateExactAllAll!$A$2:$A$84, 1, FALSE)),\"No\",\"Yes\")","v":"No"},2,null,"Xu et al., 2014, Zhao et al., 2014"]
[296,{"$f":"IF(ISERROR(VLOOKUP(A90,AllValidatedAllAll!$A$2:$A$115, 1, FALSE)),\"No\",\"Yes\")","v":"Yes"},{"$f":"IF(ISERROR(VLOOKUP(A90,CandidateExactAllAll!$A$2:$A$84, 1, FALSE)),\"No\",\"Yes\")","v":"Yes"},2,null,"Xu et al., 2014, Zhu et al., 2009"]
[362,{"$f":"IF(ISERROR(VLOOKUP(A91,AllValidatedAllAll!$A$2:$A$115, 1, FALSE)),\"No\",\"Yes\")","v":"No"},{"$f":"IF(ISERROR(VLOOKUP(A91,CandidateExactAllAll!$A$2:$A$84, 1, FALSE)),\"No\",\"Yes\")","v":"No"},2,null,"Xu et al., 2014, Zhu et al., 2009"]
[218,{"$f":"IF(ISERROR(VLOOKUP(A92,AllValidatedAllAll!$A$2:$A$115, 1, FALSE)),\"No\",\"Yes\")","v":"Yes"},{"$f":"IF(ISERROR(VLOOKUP(A92,CandidateExactAllAll!$A$2:$A$84, 1, FALSE)),\"No\",\"Yes\")","v":"Yes"},2,null,"Xu et al., 2014, Zhu et al., 2009"]
[590,{"$f":"IF(ISERROR(VLOOKUP(A93,AllValidatedAllAll!$A$2:$A$115, 1, FALSE)),\"No\",\"Yes\")","v":"No"},{"$f":"IF(ISERROR(VLOOKUP(A93,CandidateExactAllAll!$A$2:$A$84, 1, FALSE)),\"No\",\"Yes\")","v":"No"},2,null,"Xu et al., 2014, Zhu et al., 2009"]
[411,{"$f":"IF(ISERROR(VLOOKUP(A94,AllValidatedAllAll!$A$2:$A$115, 1, FALSE)),\"No\",\"Yes\")","v":"Yes"},{"$f":"IF(ISERROR(VLOOKUP(A94,CandidateExactAllAll!$A$2:$A$84, 1, FALSE)),\"No\",\"Yes\")","v":"Yes"},2,null,"Xu et al., 2014, Zhu et al., 2009"]
[136,{"$f":"IF(ISERROR(VLOOKUP(A95,AllValidatedAllAll!$A$2:$A$115, 1, FALSE)),\"No\",\"Yes\")","v":"Yes"},{"$f":"IF(ISERROR(VLOOKUP(A95,CandidateExactAllAll!$A$2:$A$84, 1, FALSE)),\"No\",\"Yes\")","v":"No"},2,null,"Yang et al., 2011, Zhao et al., 2014"]
["18b",{"$f":"IF(ISERROR(VLOOKUP(A96,AllValidatedAllAll!$A$2:$A$115, 1, FALSE)),\"No\",\"Yes\")","v":"Yes"},{"$f":"IF(ISERROR(VLOOKUP(A96,CandidateExactAllAll!$A$2:$A$84, 1, FALSE)),\"No\",\"Yes\")","v":"Yes"},2,null,"Yang et al., 2015, Zhu et al., 2009"]
["301a",{"$f":"IF(ISERROR(VLOOKUP(A97,AllValidatedAllAll!$A$2:$A$115, 1, FALSE)),\"No\",\"Yes\")","v":"No"},{"$f":"IF(ISERROR(VLOOKUP(A97,CandidateExactAllAll!$A$2:$A$84, 1, FALSE)),\"No\",\"Yes\")","v":"No"},2,null,"Yang et al., 2015, Zhao et al., 2014"]
["23a*",{"$f":"IF(ISERROR(VLOOKUP(A98,AllValidatedAllAll!$A$2:$A$115, 1, FALSE)),\"No\",\"Yes\")","v":"No"},{"$f":"IF(ISERROR(VLOOKUP(A98,CandidateExactAllAll!$A$2:$A$84, 1, FALSE)),\"No\",\"Yes\")","v":"No"},1,null,"Akehurst et al., 2015"]
["196b-5p",{"$f":"IF(ISERROR(VLOOKUP(A99,AllValidatedAllAll!$A$2:$A$115, 1, FALSE)),\"No\",\"Yes\")","v":"No"},{"$f":"IF(ISERROR(VLOOKUP(A99,CandidateExactAllAll!$A$2:$A$84, 1, FALSE)),\"No\",\"Yes\")","v":"No"},1,null,"Akehurst et al., 2015"]
["206-5p",{"$f":"IF(ISERROR(VLOOKUP(A100,AllValidatedAllAll!$A$2:$A$115, 1, FALSE)),\"No\",\"Yes\")","v":"Yes"},{"$f":"IF(ISERROR(VLOOKUP(A100,CandidateExactAllAll!$A$2:$A$84, 1, FALSE)),\"No\",\"Yes\")","v":"No"},1,null,"Akehurst et al., 2015"]
["502-5p",{"$f":"IF(ISERROR(VLOOKUP(A101,AllValidatedAllAll!$A$2:$A$115, 1, FALSE)),\"No\",\"Yes\")","v":"No"},{"$f":"IF(ISERROR(VLOOKUP(A101,CandidateExactAllAll!$A$2:$A$84, 1, FALSE)),\"No\",\"Yes\")","v":"No"},1,null,"Akehurst et al., 2015"]
["503-5p",{"$f":"IF(ISERROR(VLOOKUP(A102,AllValidatedAllAll!$A$2:$A$115, 1, FALSE)),\"No\",\"Yes\")","v":"No"},{"$f":"IF(ISERROR(VLOOKUP(A102,CandidateExactAllAll!$A$2:$A$84, 1, FALSE)),\"No\",\"Yes\")","v":"No"},1,null,"Akehurst et al., 2015"]
["758-3p",{"$f":"IF(ISERROR(VLOOKUP(A103,AllValidatedAllAll!$A$2:$A$115, 1, FALSE)),\"No\",\"Yes\")","v":"No"},{"$f":"IF(ISERROR(VLOOKUP(A103,CandidateExactAllAll!$A$2:$A$84, 1, FALSE)),\"No\",\"Yes\")","v":"No"},1,null,"Akehurst et al., 2015"]
[7,{"$f":"IF(ISERROR(VLOOKUP(A104,AllValidatedAllAll!$A$2:$A$115, 1, FALSE)),\"No\",\"Yes\")","v":"No"},{"$f":"IF(ISERROR(VLOOKUP(A104,CandidateExactAllAll!$A$2:$A$84, 1, FALSE)),\"No\",\"Yes\")","v":"No"},1,null,"Betoni et al., 2013"]
[585,{"$f":"IF(ISERROR(VLOOKUP(A105,AllValidatedAllAll!$A$2:$A$115, 1, FALSE)),\"No\",\"Yes\")","v":"No"},{"$f":"IF(ISERROR(VLOOKUP(A105,CandidateExactAllAll!$A$2:$A$84, 1, FALSE)),\"No\",\"Yes\")","v":"No"},1,null,"Betoni et al., 2013"]
["520f",{"$f":"IF(ISERROR(VLOOKUP(A106,AllValidatedAllAll!$A$2:$A$115, 1, FALSE)),\"No\",\"Yes\")","v":"No"},{"$f":"IF(ISERROR(VLOOKUP(A106,CandidateExactAllAll!$A$2:$A$84, 1, FALSE)),\"No\",\"Yes\")","v":"No"},1,null,"Betoni et al., 2013"]
["520c-3p",{"$f":"IF(ISERROR(VLOOKUP(A107,AllValidatedAllAll!$A$2:$A$115, 1, FALSE)),\"No\",\"Yes\")","v":"No"},{"$f":"IF(ISERROR(VLOOKUP(A107,CandidateExactAllAll!$A$2:$A$84, 1, FALSE)),\"No\",\"Yes\")","v":"No"},1,null,"Betoni et al., 2013"]
["196b",{"$f":"IF(ISERROR(VLOOKUP(A108,AllValidatedAllAll!$A$2:$A$115, 1, FALSE)),\"No\",\"Yes\")","v":"Yes"},{"$f":"IF(ISERROR(VLOOKUP(A108,CandidateExactAllAll!$A$2:$A$84, 1, FALSE)),\"No\",\"Yes\")","v":"Yes"},1,null,"Betoni et al., 2013"]
[128,{"$f":"IF(ISERROR(VLOOKUP(A109,AllValidatedAllAll!$A$2:$A$115, 1, FALSE)),\"No\",\"Yes\")","v":"No"},{"$f":"IF(ISERROR(VLOOKUP(A109,CandidateExactAllAll!$A$2:$A$84, 1, FALSE)),\"No\",\"Yes\")","v":"No"},1,null,"Betoni et al., 2013"]
["551b",{"$f":"IF(ISERROR(VLOOKUP(A110,AllValidatedAllAll!$A$2:$A$115, 1, FALSE)),\"No\",\"Yes\")","v":"No"},{"$f":"IF(ISERROR(VLOOKUP(A110,CandidateExactAllAll!$A$2:$A$84, 1, FALSE)),\"No\",\"Yes\")","v":"No"},1,null,"Betoni et al., 2013"]
["92b",{"$f":"IF(ISERROR(VLOOKUP(A111,AllValidatedAllAll!$A$2:$A$115, 1, FALSE)),\"No\",\"Yes\")","v":"Yes"},{"$f":"IF(ISERROR(VLOOKUP(A111,CandidateExactAllAll!$A$2:$A$84, 1, FALSE)),\"No\",\"Yes\")","v":"No"},1,null,"Choi et al., 2013"]
[197,{"$f":"IF(ISERROR(VLOOKUP(A112,AllValidatedAllAll!$A$2:$A$115, 1, FALSE)),\"No\",\"Yes\")","v":"Yes"},{"$f":"IF(ISERROR(VLOOKUP(A112,CandidateExactAllAll!$A$2:$A$84, 1, FALSE)),\"No\",\"Yes\")","v":"No"},1,null,"Choi et al., 2013"]
["296-3p",{"$f":"IF(ISERROR(VLOOKUP(A113,AllValidatedAllAll!$A$2:$A$115, 1, FALSE)),\"No\",\"Yes\")","v":"Yes"},{"$f":"IF(ISERROR(VLOOKUP(A113,CandidateExactAllAll!$A$2:$A$84, 1, FALSE)),\"No\",\"Yes\")","v":"Yes"},1,null,"Choi et al., 2013"]
[198,{"$f":"IF(ISERROR(VLOOKUP(A114,AllValidatedAllAll!$A$2:$A$115, 1, FALSE)),\"No\",\"Yes\")","v":"No"},{"$f":"IF(ISERROR(VLOOKUP(A114,CandidateExactAllAll!$A$2:$A$84, 1, FALSE)),\"No\",\"Yes\")","v":"No"},1,null,"Choi et al., 2013"]
[202,{"$f":"IF(ISERROR(VLOOKUP(A115,AllValidatedAllAll!$A$2:$A$115, 1, FALSE)),\"No\",\"Yes\")","v":"No"},{"$f":"IF(ISERROR(VLOOKUP(A115,CandidateExactAllAll!$A$2:$A$84, 1, FALSE)),\"No\",\"Yes\")","v":"No"},1,null,"Choi et al., 2013"]
[191,{"$f":"IF(ISERROR(VLOOKUP(A116,AllValidatedAllAll!$A$2:$A$115, 1, FALSE)),\"No\",\"Yes\")","v":"No"},{"$f":"IF(ISERROR(VLOOKUP(A116,CandidateExactAllAll!$A$2:$A$84, 1, FALSE)),\"No\",\"Yes\")","v":"No"},1,null,"Choi et al., 2013"]
[95,{"$f":"IF(ISERROR(VLOOKUP(A117,AllValidatedAllAll!$A$2:$A$115, 1, FALSE)),\"No\",\"Yes\")","v":"No"},{"$f":"IF(ISERROR(VLOOKUP(A117,CandidateExactAllAll!$A$2:$A$84, 1, FALSE)),\"No\",\"Yes\")","v":"No"},1,null,"Choi et al., 2013"]
[328,{"$f":"IF(ISERROR(VLOOKUP(A118,AllValidatedAllAll!$A$2:$A$115, 1, FALSE)),\"No\",\"Yes\")","v":"No"},{"$f":"IF(ISERROR(VLOOKUP(A118,CandidateExactAllAll!$A$2:$A$84, 1, FALSE)),\"No\",\"Yes\")","v":"No"},1,null,"Enquobahrie et al., 2011"]
["139-5p",{"$f":"IF(ISERROR(VLOOKUP(A119,AllValidatedAllAll!$A$2:$A$115, 1, FALSE)),\"No\",\"Yes\")","v":"No"},{"$f":"IF(ISERROR(VLOOKUP(A119,CandidateExactAllAll!$A$2:$A$84, 1, FALSE)),\"No\",\"Yes\")","v":"No"},1,null,"Enquobahrie et al., 2011"]
[500,{"$f":"IF(ISERROR(VLOOKUP(A120,AllValidatedAllAll!$A$2:$A$115, 1, FALSE)),\"No\",\"Yes\")","v":"No"},{"$f":"IF(ISERROR(VLOOKUP(A120,CandidateExactAllAll!$A$2:$A$84, 1, FALSE)),\"No\",\"Yes\")","v":"No"},1,null,"Enquobahrie et al., 2011"]
[1247,{"$f":"IF(ISERROR(VLOOKUP(A121,AllValidatedAllAll!$A$2:$A$115, 1, FALSE)),\"No\",\"Yes\")","v":"No"},{"$f":"IF(ISERROR(VLOOKUP(A121,CandidateExactAllAll!$A$2:$A$84, 1, FALSE)),\"No\",\"Yes\")","v":"No"},1,null,"Enquobahrie et al., 2011"]
[143,{"$f":"IF(ISERROR(VLOOKUP(A122,AllValidatedAllAll!$A$2:$A$115, 1, FALSE)),\"No\",\"Yes\")","v":"No"},{"$f":"IF(ISERROR(VLOOKUP(A122,CandidateExactAllAll!$A$2:$A$84, 1, FALSE)),\"No\",\"Yes\")","v":"No"},1,null,"Guo et al., 2011"]
[525,{"$f":"IF(ISERROR(VLOOKUP(A123,AllValidatedAllAll!$A$2:$A$115, 1, FALSE)),\"No\",\"Yes\")","v":"Yes"},{"$f":"IF(ISERROR(VLOOKUP(A123,CandidateExactAllAll!$A$2:$A$84, 1, FALSE)),\"No\",\"Yes\")","v":"Yes"},1,null,"Guo et al., 2011"]
[194,{"$f":"IF(ISERROR(VLOOKUP(A124,AllValidatedAllAll!$A$2:$A$115, 1, FALSE)),\"No\",\"Yes\")","v":"No"},{"$f":"IF(ISERROR(VLOOKUP(A124,CandidateExactAllAll!$A$2:$A$84, 1, FALSE)),\"No\",\"Yes\")","v":"No"},1,null,"Guo et al., 2013"]
[222,{"$f":"IF(ISERROR(VLOOKUP(A125,AllValidatedAllAll!$A$2:$A$115, 1, FALSE)),\"No\",\"Yes\")","v":"Yes"},{"$f":"IF(ISERROR(VLOOKUP(A125,CandidateExactAllAll!$A$2:$A$84, 1, FALSE)),\"No\",\"Yes\")","v":"Yes"},1,null,"Hu et al., 2009"]
["7f",{"$f":"IF(ISERROR(VLOOKUP(A126,AllValidatedAllAll!$A$2:$A$115, 1, FALSE)),\"No\",\"Yes\")","v":"No"},{"$f":"IF(ISERROR(VLOOKUP(A126,CandidateExactAllAll!$A$2:$A$84, 1, FALSE)),\"No\",\"Yes\")","v":"No"},1,null,"Hu et al., 2009"]
[565,{"$f":"IF(ISERROR(VLOOKUP(A127,AllValidatedAllAll!$A$2:$A$115, 1, FALSE)),\"No\",\"Yes\")","v":"No"},{"$f":"IF(ISERROR(VLOOKUP(A127,CandidateExactAllAll!$A$2:$A$84, 1, FALSE)),\"No\",\"Yes\")","v":"No"},1,null,"Hu et al., 2009"]
["519b-3p",{"$f":"IF(ISERROR(VLOOKUP(A128,AllValidatedAllAll!$A$2:$A$115, 1, FALSE)),\"No\",\"Yes\")","v":"No"},{"$f":"IF(ISERROR(VLOOKUP(A128,CandidateExactAllAll!$A$2:$A$84, 1, FALSE)),\"No\",\"Yes\")","v":"No"},1,null,"Hu et al., 2009"]
["450a",{"$f":"IF(ISERROR(VLOOKUP(A129,AllValidatedAllAll!$A$2:$A$115, 1, FALSE)),\"No\",\"Yes\")","v":"No"},{"$f":"IF(ISERROR(VLOOKUP(A129,CandidateExactAllAll!$A$2:$A$84, 1, FALSE)),\"No\",\"Yes\")","v":"No"},1,null,"Hu et al., 2009"]
["30e",{"$f":"IF(ISERROR(VLOOKUP(A130,AllValidatedAllAll!$A$2:$A$115, 1, FALSE)),\"No\",\"Yes\")","v":"No"},{"$f":"IF(ISERROR(VLOOKUP(A130,CandidateExactAllAll!$A$2:$A$84, 1, FALSE)),\"No\",\"Yes\")","v":"No"},1,null,"Hu et al., 2009"]
[522,{"$f":"IF(ISERROR(VLOOKUP(A131,AllValidatedAllAll!$A$2:$A$115, 1, FALSE)),\"No\",\"Yes\")","v":"No"},{"$f":"IF(ISERROR(VLOOKUP(A131,CandidateExactAllAll!$A$2:$A$84, 1, FALSE)),\"No\",\"Yes\")","v":"No"},1,null,"Hu et al., 2009"]
["486-3p",{"$f":"IF(ISERROR(VLOOKUP(A132,AllValidatedAllAll!$A$2:$A$115, 1, FALSE)),\"No\",\"Yes\")","v":"No"},{"$f":"IF(ISERROR(VLOOKUP(A132,CandidateExactAllAll!$A$2:$A$84, 1, FALSE)),\"No\",\"Yes\")","v":"No"},1,null,"Hu et al., 2009"]
[658,{"$f":"IF(ISERROR(VLOOKUP(A133,AllValidatedAllAll!$A$2:$A$115, 1, FALSE)),\"No\",\"Yes\")","v":"No"},{"$f":"IF(ISERROR(VLOOKUP(A133,CandidateExactAllAll!$A$2:$A$84, 1, FALSE)),\"No\",\"Yes\")","v":"No"},1,null,"Hu et al., 2009"]
["523-3p",{"$f":"IF(ISERROR(VLOOKUP(A134,AllValidatedAllAll!$A$2:$A$115, 1, FALSE)),\"No\",\"Yes\")","v":"No"},{"$f":"IF(ISERROR(VLOOKUP(A134,CandidateExactAllAll!$A$2:$A$84, 1, FALSE)),\"No\",\"Yes\")","v":"No"},1,null,"Hu et al., 2009"]
["423-5p",{"$f":"IF(ISERROR(VLOOKUP(A135,AllValidatedAllAll!$A$2:$A$115, 1, FALSE)),\"No\",\"Yes\")","v":"No"},{"$f":"IF(ISERROR(VLOOKUP(A135,CandidateExactAllAll!$A$2:$A$84, 1, FALSE)),\"No\",\"Yes\")","v":"No"},1,null,"Hu et al., 2009"]
["491-5p",{"$f":"IF(ISERROR(VLOOKUP(A136,AllValidatedAllAll!$A$2:$A$115, 1, FALSE)),\"No\",\"Yes\")","v":"No"},{"$f":"IF(ISERROR(VLOOKUP(A136,CandidateExactAllAll!$A$2:$A$84, 1, FALSE)),\"No\",\"Yes\")","v":"No"},1,null,"Hu et al., 2009"]
[612,{"$f":"IF(ISERROR(VLOOKUP(A137,AllValidatedAllAll!$A$2:$A$115, 1, FALSE)),\"No\",\"Yes\")","v":"No"},{"$f":"IF(ISERROR(VLOOKUP(A137,CandidateExactAllAll!$A$2:$A$84, 1, FALSE)),\"No\",\"Yes\")","v":"No"},1,null,"Hu et al., 2009"]
["508-5p",{"$f":"IF(ISERROR(VLOOKUP(A138,AllValidatedAllAll!$A$2:$A$115, 1, FALSE)),\"No\",\"Yes\")","v":"No"},{"$f":"IF(ISERROR(VLOOKUP(A138,CandidateExactAllAll!$A$2:$A$84, 1, FALSE)),\"No\",\"Yes\")","v":"No"},1,null,"Hu et al., 2009"]
["193b*",{"$f":"IF(ISERROR(VLOOKUP(A139,AllValidatedAllAll!$A$2:$A$115, 1, FALSE)),\"No\",\"Yes\")","v":"Yes"},{"$f":"IF(ISERROR(VLOOKUP(A139,CandidateExactAllAll!$A$2:$A$84, 1, FALSE)),\"No\",\"Yes\")","v":"Yes"},1,null,"Ishibashi et al., 2012"]
["520a-3p",{"$f":"IF(ISERROR(VLOOKUP(A140,AllValidatedAllAll!$A$2:$A$115, 1, FALSE)),\"No\",\"Yes\")","v":"No"},{"$f":"IF(ISERROR(VLOOKUP(A140,CandidateExactAllAll!$A$2:$A$84, 1, FALSE)),\"No\",\"Yes\")","v":"No"},1,null,"Ishibashi et al., 2012"]
["518f",{"$f":"IF(ISERROR(VLOOKUP(A141,AllValidatedAllAll!$A$2:$A$115, 1, FALSE)),\"No\",\"Yes\")","v":"No"},{"$f":"IF(ISERROR(VLOOKUP(A141,CandidateExactAllAll!$A$2:$A$84, 1, FALSE)),\"No\",\"Yes\")","v":"No"},1,null,"Ishibashi et al., 2012"]
["525-5p",{"$f":"IF(ISERROR(VLOOKUP(A142,AllValidatedAllAll!$A$2:$A$115, 1, FALSE)),\"No\",\"Yes\")","v":"Yes"},{"$f":"IF(ISERROR(VLOOKUP(A142,CandidateExactAllAll!$A$2:$A$84, 1, FALSE)),\"No\",\"Yes\")","v":"Yes"},1,null,"Ishibashi et al., 2012"]
["451a",{"$f":"IF(ISERROR(VLOOKUP(A143,AllValidatedAllAll!$A$2:$A$115, 1, FALSE)),\"No\",\"Yes\")","v":"No"},{"$f":"IF(ISERROR(VLOOKUP(A143,CandidateExactAllAll!$A$2:$A$84, 1, FALSE)),\"No\",\"Yes\")","v":"No"},1,null,"Jiang et al., 2015"]
[17,{"$f":"IF(ISERROR(VLOOKUP(A144,AllValidatedAllAll!$A$2:$A$115, 1, FALSE)),\"No\",\"Yes\")","v":"Yes"},{"$f":"IF(ISERROR(VLOOKUP(A144,CandidateExactAllAll!$A$2:$A$84, 1, FALSE)),\"No\",\"Yes\")","v":"Yes"},1,null,"Jiang et al., 2015"]
[516,{"$f":"IF(ISERROR(VLOOKUP(A145,AllValidatedAllAll!$A$2:$A$115, 1, FALSE)),\"No\",\"Yes\")","v":"No"},{"$f":"IF(ISERROR(VLOOKUP(A145,CandidateExactAllAll!$A$2:$A$84, 1, FALSE)),\"No\",\"Yes\")","v":"No"},1,null,"Jiang et al., 2015"]
["135a",{"$f":"IF(ISERROR(VLOOKUP(A146,AllValidatedAllAll!$A$2:$A$115, 1, FALSE)),\"No\",\"Yes\")","v":"No"},{"$f":"IF(ISERROR(VLOOKUP(A146,CandidateExactAllAll!$A$2:$A$84, 1, FALSE)),\"No\",\"Yes\")","v":"No"},1,null,"Jiang et al., 2015"]
[96,{"$f":"IF(ISERROR(VLOOKUP(A147,AllValidatedAllAll!$A$2:$A$115, 1, FALSE)),\"No\",\"Yes\")","v":"No"},{"$f":"IF(ISERROR(VLOOKUP(A147,CandidateExactAllAll!$A$2:$A$84, 1, FALSE)),\"No\",\"Yes\")","v":"No"},1,null,"Jiang et al., 2015"]
[196,{"$f":"IF(ISERROR(VLOOKUP(A148,AllValidatedAllAll!$A$2:$A$115, 1, FALSE)),\"No\",\"Yes\")","v":"No"},{"$f":"IF(ISERROR(VLOOKUP(A148,CandidateExactAllAll!$A$2:$A$84, 1, FALSE)),\"No\",\"Yes\")","v":"No"},1,null,"Jiang et al., 2015"]
["362-3p",{"$f":"IF(ISERROR(VLOOKUP(A149,AllValidatedAllAll!$A$2:$A$115, 1, FALSE)),\"No\",\"Yes\")","v":"No"},{"$f":"IF(ISERROR(VLOOKUP(A149,CandidateExactAllAll!$A$2:$A$84, 1, FALSE)),\"No\",\"Yes\")","v":"No"},1,null,"Jiang et al., 2015"]
["10a",{"$f":"IF(ISERROR(VLOOKUP(A150,AllValidatedAllAll!$A$2:$A$115, 1, FALSE)),\"No\",\"Yes\")","v":"No"},{"$f":"IF(ISERROR(VLOOKUP(A150,CandidateExactAllAll!$A$2:$A$84, 1, FALSE)),\"No\",\"Yes\")","v":"No"},1,null,"Li et al., 2013"]
[114,{"$f":"IF(ISERROR(VLOOKUP(A151,AllValidatedAllAll!$A$2:$A$115, 1, FALSE)),\"No\",\"Yes\")","v":"No"},{"$f":"IF(ISERROR(VLOOKUP(A151,CandidateExactAllAll!$A$2:$A$84, 1, FALSE)),\"No\",\"Yes\")","v":"No"},1,null,"Li et al., 2013"]
["15b*",{"$f":"IF(ISERROR(VLOOKUP(A152,AllValidatedAllAll!$A$2:$A$115, 1, FALSE)),\"No\",\"Yes\")","v":"No"},{"$f":"IF(ISERROR(VLOOKUP(A152,CandidateExactAllAll!$A$2:$A$84, 1, FALSE)),\"No\",\"Yes\")","v":"No"},1,null,"Li et al., 2013"]
["519e",{"$f":"IF(ISERROR(VLOOKUP(A153,AllValidatedAllAll!$A$2:$A$115, 1, FALSE)),\"No\",\"Yes\")","v":"No"},{"$f":"IF(ISERROR(VLOOKUP(A153,CandidateExactAllAll!$A$2:$A$84, 1, FALSE)),\"No\",\"Yes\")","v":"No"},1,null,"Li et al., 2013"]
["299a-5p",{"$f":"IF(ISERROR(VLOOKUP(A154,AllValidatedAllAll!$A$2:$A$115, 1, FALSE)),\"No\",\"Yes\")","v":"No"},{"$f":"IF(ISERROR(VLOOKUP(A154,CandidateExactAllAll!$A$2:$A$84, 1, FALSE)),\"No\",\"Yes\")","v":"No"},1,null,"Li et al., 2013"]
["23a",{"$f":"IF(ISERROR(VLOOKUP(A155,AllValidatedAllAll!$A$2:$A$115, 1, FALSE)),\"No\",\"Yes\")","v":"No"},{"$f":"IF(ISERROR(VLOOKUP(A155,CandidateExactAllAll!$A$2:$A$84, 1, FALSE)),\"No\",\"Yes\")","v":"No"},1,null,"Li et al., 2013"]
["23b",{"$f":"IF(ISERROR(VLOOKUP(A156,AllValidatedAllAll!$A$2:$A$115, 1, FALSE)),\"No\",\"Yes\")","v":"No"},{"$f":"IF(ISERROR(VLOOKUP(A156,CandidateExactAllAll!$A$2:$A$84, 1, FALSE)),\"No\",\"Yes\")","v":"No"},1,null,"Li et al., 2013"]
["34a",{"$f":"IF(ISERROR(VLOOKUP(A157,AllValidatedAllAll!$A$2:$A$115, 1, FALSE)),\"No\",\"Yes\")","v":"Yes"},{"$f":"IF(ISERROR(VLOOKUP(A157,CandidateExactAllAll!$A$2:$A$84, 1, FALSE)),\"No\",\"Yes\")","v":"Yes"},1,null,"Li et al., 2013"]
["525-3p",{"$f":"IF(ISERROR(VLOOKUP(A158,AllValidatedAllAll!$A$2:$A$115, 1, FALSE)),\"No\",\"Yes\")","v":"No"},{"$f":"IF(ISERROR(VLOOKUP(A158,CandidateExactAllAll!$A$2:$A$84, 1, FALSE)),\"No\",\"Yes\")","v":"No"},1,null,"Li et al., 2013"]
["199a-5p",{"$f":"IF(ISERROR(VLOOKUP(A159,AllValidatedAllAll!$A$2:$A$115, 1, FALSE)),\"No\",\"Yes\")","v":"No"},{"$f":"IF(ISERROR(VLOOKUP(A159,CandidateExactAllAll!$A$2:$A$84, 1, FALSE)),\"No\",\"Yes\")","v":"No"},1,null,"Li et al., 2013"]
["512-5p",{"$f":"IF(ISERROR(VLOOKUP(A160,AllValidatedAllAll!$A$2:$A$115, 1, FALSE)),\"No\",\"Yes\")","v":"No"},{"$f":"IF(ISERROR(VLOOKUP(A160,CandidateExactAllAll!$A$2:$A$84, 1, FALSE)),\"No\",\"Yes\")","v":"No"},1,null,"Li et al., 2013"]
["30b",{"$f":"IF(ISERROR(VLOOKUP(A161,AllValidatedAllAll!$A$2:$A$115, 1, FALSE)),\"No\",\"Yes\")","v":"No"},{"$f":"IF(ISERROR(VLOOKUP(A161,CandidateExactAllAll!$A$2:$A$84, 1, FALSE)),\"No\",\"Yes\")","v":"No"},1,null,"Li et al., 2013"]
[107,{"$f":"IF(ISERROR(VLOOKUP(A162,AllValidatedAllAll!$A$2:$A$115, 1, FALSE)),\"No\",\"Yes\")","v":"No"},{"$f":"IF(ISERROR(VLOOKUP(A162,CandidateExactAllAll!$A$2:$A$84, 1, FALSE)),\"No\",\"Yes\")","v":"No"},1,null,"Li et al., 2013"]
[496,{"$f":"IF(ISERROR(VLOOKUP(A163,AllValidatedAllAll!$A$2:$A$115, 1, FALSE)),\"No\",\"Yes\")","v":"No"},{"$f":"IF(ISERROR(VLOOKUP(A163,CandidateExactAllAll!$A$2:$A$84, 1, FALSE)),\"No\",\"Yes\")","v":"No"},1,null,"Mayor-Lynn et al., 2011"]
[431,{"$f":"IF(ISERROR(VLOOKUP(A164,AllValidatedAllAll!$A$2:$A$115, 1, FALSE)),\"No\",\"Yes\")","v":"No"},{"$f":"IF(ISERROR(VLOOKUP(A164,CandidateExactAllAll!$A$2:$A$84, 1, FALSE)),\"No\",\"Yes\")","v":"No"},1,null,"Mayor-Lynn et al., 2011"]
[720,{"$f":"IF(ISERROR(VLOOKUP(A165,AllValidatedAllAll!$A$2:$A$115, 1, FALSE)),\"No\",\"Yes\")","v":"No"},{"$f":"IF(ISERROR(VLOOKUP(A165,CandidateExactAllAll!$A$2:$A$84, 1, FALSE)),\"No\",\"Yes\")","v":"No"},1,null,"Mayor-Lynn et al., 2011"]
["654-3p",{"$f":"IF(ISERROR(VLOOKUP(A166,AllValidatedAllAll!$A$2:$A$115, 1, FALSE)),\"No\",\"Yes\")","v":"No"},{"$f":"IF(ISERROR(VLOOKUP(A166,CandidateExactAllAll!$A$2:$A$84, 1, FALSE)),\"No\",\"Yes\")","v":"No"},1,null,"Mayor-Lynn et al., 2011"]
["181d",{"$f":"IF(ISERROR(VLOOKUP(A167,AllValidatedAllAll!$A$2:$A$115, 1, FALSE)),\"No\",\"Yes\")","v":"No"},{"$f":"IF(ISERROR(VLOOKUP(A167,CandidateExactAllAll!$A$2:$A$84, 1, FALSE)),\"No\",\"Yes\")","v":"No"},1,null,"Mayor-Lynn et al., 2011"]
["145*",{"$f":"IF(ISERROR(VLOOKUP(A168,AllValidatedAllAll!$A$2:$A$115, 1, FALSE)),\"No\",\"Yes\")","v":"Yes"},{"$f":"IF(ISERROR(VLOOKUP(A168,CandidateExactAllAll!$A$2:$A$84, 1, FALSE)),\"No\",\"Yes\")","v":"Yes"},1,null,"Mayor-Lynn et al., 2011"]
[539,{"$f":"IF(ISERROR(VLOOKUP(A169,AllValidatedAllAll!$A$2:$A$115, 1, FALSE)),\"No\",\"Yes\")","v":"No"},{"$f":"IF(ISERROR(VLOOKUP(A169,CandidateExactAllAll!$A$2:$A$84, 1, FALSE)),\"No\",\"Yes\")","v":"No"},1,null,"Mayor-Lynn et al., 2011"]
["let-7e",{"$f":"IF(ISERROR(VLOOKUP(A170,AllValidatedAllAll!$A$2:$A$115, 1, FALSE)),\"No\",\"Yes\")","v":"No"},{"$f":"IF(ISERROR(VLOOKUP(A170,CandidateExactAllAll!$A$2:$A$84, 1, FALSE)),\"No\",\"Yes\")","v":"No"},1,null,"Mayor-Lynn et al., 2011"]
["let-7b",{"$f":"IF(ISERROR(VLOOKUP(A171,AllValidatedAllAll!$A$2:$A$115, 1, FALSE)),\"No\",\"Yes\")","v":"No"},{"$f":"IF(ISERROR(VLOOKUP(A171,CandidateExactAllAll!$A$2:$A$84, 1, FALSE)),\"No\",\"Yes\")","v":"No"},1,null,"Noack et al., 2011"]
["302*",{"$f":"IF(ISERROR(VLOOKUP(A172,AllValidatedAllAll!$A$2:$A$115, 1, FALSE)),\"No\",\"Yes\")","v":"No"},{"$f":"IF(ISERROR(VLOOKUP(A172,CandidateExactAllAll!$A$2:$A$84, 1, FALSE)),\"No\",\"Yes\")","v":"No"},1,null,"Noack et al., 2011"]
[104,{"$f":"IF(ISERROR(VLOOKUP(A173,AllValidatedAllAll!$A$2:$A$115, 1, FALSE)),\"No\",\"Yes\")","v":"No"},{"$f":"IF(ISERROR(VLOOKUP(A173,CandidateExactAllAll!$A$2:$A$84, 1, FALSE)),\"No\",\"Yes\")","v":"No"},1,null,"Noack et al., 2011"]
["128a",{"$f":"IF(ISERROR(VLOOKUP(A174,AllValidatedAllAll!$A$2:$A$115, 1, FALSE)),\"No\",\"Yes\")","v":"No"},{"$f":"IF(ISERROR(VLOOKUP(A174,CandidateExactAllAll!$A$2:$A$84, 1, FALSE)),\"No\",\"Yes\")","v":"No"},1,null,"Noack et al., 2011"]
["182*",{"$f":"IF(ISERROR(VLOOKUP(A175,AllValidatedAllAll!$A$2:$A$115, 1, FALSE)),\"No\",\"Yes\")","v":"Yes"},{"$f":"IF(ISERROR(VLOOKUP(A175,CandidateExactAllAll!$A$2:$A$84, 1, FALSE)),\"No\",\"Yes\")","v":"Yes"},1,null,"Noack et al., 2011"]
["133b",{"$f":"IF(ISERROR(VLOOKUP(A176,AllValidatedAllAll!$A$2:$A$115, 1, FALSE)),\"No\",\"Yes\")","v":"No"},{"$f":"IF(ISERROR(VLOOKUP(A176,CandidateExactAllAll!$A$2:$A$84, 1, FALSE)),\"No\",\"Yes\")","v":"No"},1,null,"Noack et al., 2011"]
[1233,{"$f":"IF(ISERROR(VLOOKUP(A177,AllValidatedAllAll!$A$2:$A$115, 1, FALSE)),\"No\",\"Yes\")","v":"Yes"},{"$f":"IF(ISERROR(VLOOKUP(A177,CandidateExactAllAll!$A$2:$A$84, 1, FALSE)),\"No\",\"Yes\")","v":"No"},1,null,"Ura et al., 2014"]
[650,{"$f":"IF(ISERROR(VLOOKUP(A178,AllValidatedAllAll!$A$2:$A$115, 1, FALSE)),\"No\",\"Yes\")","v":"No"},{"$f":"IF(ISERROR(VLOOKUP(A178,CandidateExactAllAll!$A$2:$A$84, 1, FALSE)),\"No\",\"Yes\")","v":"No"},1,null,"Ura et al., 2014"]
["520a",{"$f":"IF(ISERROR(VLOOKUP(A179,AllValidatedAllAll!$A$2:$A$115, 1, FALSE)),\"No\",\"Yes\")","v":"Yes"},{"$f":"IF(ISERROR(VLOOKUP(A179,CandidateExactAllAll!$A$2:$A$84, 1, FALSE)),\"No\",\"Yes\")","v":"No"},1,null,"Ura et al., 2014"]
[215,{"$f":"IF(ISERROR(VLOOKUP(A180,AllValidatedAllAll!$A$2:$A$115, 1, FALSE)),\"No\",\"Yes\")","v":"No"},{"$f":"IF(ISERROR(VLOOKUP(A180,CandidateExactAllAll!$A$2:$A$84, 1, FALSE)),\"No\",\"Yes\")","v":"No"},1,null,"Ura et al., 2014"]
["193a-3p",{"$f":"IF(ISERROR(VLOOKUP(A181,AllValidatedAllAll!$A$2:$A$115, 1, FALSE)),\"No\",\"Yes\")","v":"No"},{"$f":"IF(ISERROR(VLOOKUP(A181,CandidateExactAllAll!$A$2:$A$84, 1, FALSE)),\"No\",\"Yes\")","v":"No"},1,null,"Ura et al., 2014"]
[668,{"$f":"IF(ISERROR(VLOOKUP(A182,AllValidatedAllAll!$A$2:$A$115, 1, FALSE)),\"No\",\"Yes\")","v":"No"},{"$f":"IF(ISERROR(VLOOKUP(A182,CandidateExactAllAll!$A$2:$A$84, 1, FALSE)),\"No\",\"Yes\")","v":"No"},1,null,"Ura et al., 2014"]
["516a-5p",{"$f":"IF(ISERROR(VLOOKUP(A183,AllValidatedAllAll!$A$2:$A$115, 1, FALSE)),\"No\",\"Yes\")","v":"Yes"},{"$f":"IF(ISERROR(VLOOKUP(A183,CandidateExactAllAll!$A$2:$A$84, 1, FALSE)),\"No\",\"Yes\")","v":"Yes"},1,null,"Wang, W. et al. 2012"]
[2277,{"$f":"IF(ISERROR(VLOOKUP(A184,AllValidatedAllAll!$A$2:$A$115, 1, FALSE)),\"No\",\"Yes\")","v":"No"},{"$f":"IF(ISERROR(VLOOKUP(A184,CandidateExactAllAll!$A$2:$A$84, 1, FALSE)),\"No\",\"Yes\")","v":"No"},1,null,"Wang, W. et al. 2012"]
["524-3p",{"$f":"IF(ISERROR(VLOOKUP(A185,AllValidatedAllAll!$A$2:$A$115, 1, FALSE)),\"No\",\"Yes\")","v":"No"},{"$f":"IF(ISERROR(VLOOKUP(A185,CandidateExactAllAll!$A$2:$A$84, 1, FALSE)),\"No\",\"Yes\")","v":"No"},1,null,"Wang, W. et al. 2012"]
[192,{"$f":"IF(ISERROR(VLOOKUP(A186,AllValidatedAllAll!$A$2:$A$115, 1, FALSE)),\"No\",\"Yes\")","v":"No"},{"$f":"IF(ISERROR(VLOOKUP(A186,CandidateExactAllAll!$A$2:$A$84, 1, FALSE)),\"No\",\"Yes\")","v":"No"},1,null,"Wang, W. et al. 2012"]
[1301,{"$f":"IF(ISERROR(VLOOKUP(A187,AllValidatedAllAll!$A$2:$A$115, 1, FALSE)),\"No\",\"Yes\")","v":"Yes"},{"$f":"IF(ISERROR(VLOOKUP(A187,CandidateExactAllAll!$A$2:$A$84, 1, FALSE)),\"No\",\"Yes\")","v":"No"},1,null,"Weedon-Fekjær al., 2014"]
["223-3p",{"$f":"IF(ISERROR(VLOOKUP(A188,AllValidatedAllAll!$A$2:$A$115, 1, FALSE)),\"No\",\"Yes\")","v":"Yes"},{"$f":"IF(ISERROR(VLOOKUP(A188,CandidateExactAllAll!$A$2:$A$84, 1, FALSE)),\"No\",\"Yes\")","v":"No"},1,null,"Weedon-Fekjær al., 2014"]
["224-5p",{"$f":"IF(ISERROR(VLOOKUP(A189,AllValidatedAllAll!$A$2:$A$115, 1, FALSE)),\"No\",\"Yes\")","v":"Yes"},{"$f":"IF(ISERROR(VLOOKUP(A189,CandidateExactAllAll!$A$2:$A$84, 1, FALSE)),\"No\",\"Yes\")","v":"No"},1,null,"Weedon-Fekjær al., 2014"]
["574-5p",{"$f":"IF(ISERROR(VLOOKUP(A190,AllValidatedAllAll!$A$2:$A$115, 1, FALSE)),\"No\",\"Yes\")","v":"Yes"},{"$f":"IF(ISERROR(VLOOKUP(A190,CandidateExactAllAll!$A$2:$A$84, 1, FALSE)),\"No\",\"Yes\")","v":"No"},1,null,"Wu et al., 2012"]
["130b",{"$f":"IF(ISERROR(VLOOKUP(A191,AllValidatedAllAll!$A$2:$A$115, 1, FALSE)),\"No\",\"Yes\")","v":"Yes"},{"$f":"IF(ISERROR(VLOOKUP(A191,CandidateExactAllAll!$A$2:$A$84, 1, FALSE)),\"No\",\"Yes\")","v":"No"},1,null,"Wu et al., 2012"]
[103,{"$f":"IF(ISERROR(VLOOKUP(A192,AllValidatedAllAll!$A$2:$A$115, 1, FALSE)),\"No\",\"Yes\")","v":"Yes"},{"$f":"IF(ISERROR(VLOOKUP(A192,CandidateExactAllAll!$A$2:$A$84, 1, FALSE)),\"No\",\"Yes\")","v":"No"},1,null,"Wu et al., 2012"]
[425,{"$f":"IF(ISERROR(VLOOKUP(A193,AllValidatedAllAll!$A$2:$A$115, 1, FALSE)),\"No\",\"Yes\")","v":"No"},{"$f":"IF(ISERROR(VLOOKUP(A193,CandidateExactAllAll!$A$2:$A$84, 1, FALSE)),\"No\",\"Yes\")","v":"No"},1,null,"Wu et al., 2012"]
[151,{"$f":"IF(ISERROR(VLOOKUP(A194,AllValidatedAllAll!$A$2:$A$115, 1, FALSE)),\"No\",\"Yes\")","v":"Yes"},{"$f":"IF(ISERROR(VLOOKUP(A194,CandidateExactAllAll!$A$2:$A$84, 1, FALSE)),\"No\",\"Yes\")","v":"Yes"},1,null,"Xu et al., 2014"]
["17-3p",{"$f":"IF(ISERROR(VLOOKUP(A195,AllValidatedAllAll!$A$2:$A$115, 1, FALSE)),\"No\",\"Yes\")","v":"Yes"},{"$f":"IF(ISERROR(VLOOKUP(A195,CandidateExactAllAll!$A$2:$A$84, 1, FALSE)),\"No\",\"Yes\")","v":"Yes"},1,null,"Xu et al., 2014"]
["525*",{"$f":"IF(ISERROR(VLOOKUP(A196,AllValidatedAllAll!$A$2:$A$115, 1, FALSE)),\"No\",\"Yes\")","v":"Yes"},{"$f":"IF(ISERROR(VLOOKUP(A196,CandidateExactAllAll!$A$2:$A$84, 1, FALSE)),\"No\",\"Yes\")","v":"Yes"},1,null,"Xu et al., 2014"]
[524,{"$f":"IF(ISERROR(VLOOKUP(A197,AllValidatedAllAll!$A$2:$A$115, 1, FALSE)),\"No\",\"Yes\")","v":"Yes"},{"$f":"IF(ISERROR(VLOOKUP(A197,CandidateExactAllAll!$A$2:$A$84, 1, FALSE)),\"No\",\"Yes\")","v":"Yes"},1,null,"Xu et al., 2014"]
[379,{"$f":"IF(ISERROR(VLOOKUP(A198,AllValidatedAllAll!$A$2:$A$115, 1, FALSE)),\"No\",\"Yes\")","v":"Yes"},{"$f":"IF(ISERROR(VLOOKUP(A198,CandidateExactAllAll!$A$2:$A$84, 1, FALSE)),\"No\",\"Yes\")","v":"Yes"},1,null,"Xu et al., 2014"]
["let-7f-1-star",{"$f":"IF(ISERROR(VLOOKUP(A199,AllValidatedAllAll!$A$2:$A$115, 1, FALSE)),\"No\",\"Yes\")","v":"No"},{"$f":"IF(ISERROR(VLOOKUP(A199,CandidateExactAllAll!$A$2:$A$84, 1, FALSE)),\"No\",\"Yes\")","v":"No"},1,null,"Yang et al., 2011"]
["let-7a-star",{"$f":"IF(ISERROR(VLOOKUP(A200,AllValidatedAllAll!$A$2:$A$115, 1, FALSE)),\"No\",\"Yes\")","v":"No"},{"$f":"IF(ISERROR(VLOOKUP(A200,CandidateExactAllAll!$A$2:$A$84, 1, FALSE)),\"No\",\"Yes\")","v":"No"},1,null,"Yang et al., 2011"]
[1260,{"$f":"IF(ISERROR(VLOOKUP(A201,AllValidatedAllAll!$A$2:$A$115, 1, FALSE)),\"No\",\"Yes\")","v":"No"},{"$f":"IF(ISERROR(VLOOKUP(A201,CandidateExactAllAll!$A$2:$A$84, 1, FALSE)),\"No\",\"Yes\")","v":"No"},1,null,"Yang et al., 2011"]
["let-7d",{"$f":"IF(ISERROR(VLOOKUP(A202,AllValidatedAllAll!$A$2:$A$115, 1, FALSE)),\"No\",\"Yes\")","v":"No"},{"$f":"IF(ISERROR(VLOOKUP(A202,CandidateExactAllAll!$A$2:$A$84, 1, FALSE)),\"No\",\"Yes\")","v":"No"},1,null,"Yang et al., 2011"]
[1272,{"$f":"IF(ISERROR(VLOOKUP(A203,AllValidatedAllAll!$A$2:$A$115, 1, FALSE)),\"No\",\"Yes\")","v":"No"},{"$f":"IF(ISERROR(VLOOKUP(A203,CandidateExactAllAll!$A$2:$A$84, 1, FALSE)),\"No\",\"Yes\")","v":"No"},1,null,"Yang et al., 2011"]
["135b",{"$f":"IF(ISERROR(VLOOKUP(A204,AllValidatedAllAll!$A$2:$A$115, 1, FALSE)),\"No\",\"Yes\")","v":"No"},{"$f":"IF(ISERROR(VLOOKUP(A204,CandidateExactAllAll!$A$2:$A$84, 1, FALSE)),\"No\",\"Yes\")","v":"No"},1,null,"Yang et al., 2015"]
["188-5p",{"$f":"IF(ISERROR(VLOOKUP(A205,AllValidatedAllAll!$A$2:$A$115, 1, FALSE)),\"No\",\"Yes\")","v":"No"},{"$f":"IF(ISERROR(VLOOKUP(A205,CandidateExactAllAll!$A$2:$A$84, 1, FALSE)),\"No\",\"Yes\")","v":"No"},1,null,"Yang et al., 2015"]
[203,{"$f":"IF(ISERROR(VLOOKUP(A206,AllValidatedAllAll!$A$2:$A$115, 1, FALSE)),\"No\",\"Yes\")","v":"No"},{"$f":"IF(ISERROR(VLOOKUP(A206,CandidateExactAllAll!$A$2:$A$84, 1, FALSE)),\"No\",\"Yes\")","v":"No"},1,null,"Yang et al., 2015"]
[205,{"$f":"IF(ISERROR(VLOOKUP(A207,AllValidatedAllAll!$A$2:$A$115, 1, FALSE)),\"No\",\"Yes\")","v":"No"},{"$f":"IF(ISERROR(VLOOKUP(A207,CandidateExactAllAll!$A$2:$A$84, 1, FALSE)),\"No\",\"Yes\")","v":"No"},1,null,"Yang et al., 2015"]
["518-3p",{"$f":"IF(ISERROR(VLOOKUP(A208,AllValidatedAllAll!$A$2:$A$115, 1, FALSE)),\"No\",\"Yes\")","v":"No"},{"$f":"IF(ISERROR(VLOOKUP(A208,CandidateExactAllAll!$A$2:$A$84, 1, FALSE)),\"No\",\"Yes\")","v":"No"},1,null,"Yang et al., 2015"]
[93,{"$f":"IF(ISERROR(VLOOKUP(A209,AllValidatedAllAll!$A$2:$A$115, 1, FALSE)),\"No\",\"Yes\")","v":"No"},{"$f":"IF(ISERROR(VLOOKUP(A209,CandidateExactAllAll!$A$2:$A$84, 1, FALSE)),\"No\",\"Yes\")","v":"No"},1,null,"Yang et al., 2015"]
["125b-1-3p",{"$f":"IF(ISERROR(VLOOKUP(A210,AllValidatedAllAll!$A$2:$A$115, 1, FALSE)),\"No\",\"Yes\")","v":"Yes"},{"$f":"IF(ISERROR(VLOOKUP(A210,CandidateExactAllAll!$A$2:$A$84, 1, FALSE)),\"No\",\"Yes\")","v":"Yes"},1,null,"Zhang et al., 2015"]
[355,{"$f":"IF(ISERROR(VLOOKUP(A211,AllValidatedAllAll!$A$2:$A$115, 1, FALSE)),\"No\",\"Yes\")","v":"No"},{"$f":"IF(ISERROR(VLOOKUP(A211,CandidateExactAllAll!$A$2:$A$84, 1, FALSE)),\"No\",\"Yes\")","v":"No"},1,null,"Zhang et al., 2015"]
[1469,{"$f":"IF(ISERROR(VLOOKUP(A212,AllValidatedAllAll!$A$2:$A$115, 1, FALSE)),\"No\",\"Yes\")","v":"No"},{"$f":"IF(ISERROR(VLOOKUP(A212,CandidateExactAllAll!$A$2:$A$84, 1, FALSE)),\"No\",\"Yes\")","v":"No"},1,null,"Zhang et al., 2015"]
["29a-3p",{"$f":"IF(ISERROR(VLOOKUP(A213,AllValidatedAllAll!$A$2:$A$115, 1, FALSE)),\"No\",\"Yes\")","v":"No"},{"$f":"IF(ISERROR(VLOOKUP(A213,CandidateExactAllAll!$A$2:$A$84, 1, FALSE)),\"No\",\"Yes\")","v":"No"},1,null,"Zhang et al., 2015"]
["200c",{"$f":"IF(ISERROR(VLOOKUP(A214,AllValidatedAllAll!$A$2:$A$115, 1, FALSE)),\"No\",\"Yes\")","v":"No"},{"$f":"IF(ISERROR(VLOOKUP(A214,CandidateExactAllAll!$A$2:$A$84, 1, FALSE)),\"No\",\"Yes\")","v":"No"},1,null,"Zhang et al., 2015"]
[744,{"$f":"IF(ISERROR(VLOOKUP(A215,AllValidatedAllAll!$A$2:$A$115, 1, FALSE)),\"No\",\"Yes\")","v":"No"},{"$f":"IF(ISERROR(VLOOKUP(A215,CandidateExactAllAll!$A$2:$A$84, 1, FALSE)),\"No\",\"Yes\")","v":"No"},1,null,"Zhang et al., 2015"]
[1826,{"$f":"IF(ISERROR(VLOOKUP(A216,AllValidatedAllAll!$A$2:$A$115, 1, FALSE)),\"No\",\"Yes\")","v":"No"},{"$f":"IF(ISERROR(VLOOKUP(A216,CandidateExactAllAll!$A$2:$A$84, 1, FALSE)),\"No\",\"Yes\")","v":"No"},1,null,"Zhang et al., 2015"]
["140-3p",{"$f":"IF(ISERROR(VLOOKUP(A217,AllValidatedAllAll!$A$2:$A$115, 1, FALSE)),\"No\",\"Yes\")","v":"No"},{"$f":"IF(ISERROR(VLOOKUP(A217,CandidateExactAllAll!$A$2:$A$84, 1, FALSE)),\"No\",\"Yes\")","v":"No"},1,null,"Zhao et al., 2014"]
[494,{"$f":"IF(ISERROR(VLOOKUP(A218,AllValidatedAllAll!$A$2:$A$115, 1, FALSE)),\"No\",\"Yes\")","v":"Yes"},{"$f":"IF(ISERROR(VLOOKUP(A218,CandidateExactAllAll!$A$2:$A$84, 1, FALSE)),\"No\",\"Yes\")","v":"No"},1,null,"Zhao et al., 2014"]
["376c",{"$f":"IF(ISERROR(VLOOKUP(A219,AllValidatedAllAll!$A$2:$A$115, 1, FALSE)),\"No\",\"Yes\")","v":"Yes"},{"$f":"IF(ISERROR(VLOOKUP(A219,CandidateExactAllAll!$A$2:$A$84, 1, FALSE)),\"No\",\"Yes\")","v":"Yes"},1,null,"Zhao et al., 2014"]
[4324,{"$f":"IF(ISERROR(VLOOKUP(A220,AllValidatedAllAll!$A$2:$A$115, 1, FALSE)),\"No\",\"Yes\")","v":"No"},{"$f":"IF(ISERROR(VLOOKUP(A220,CandidateExactAllAll!$A$2:$A$84, 1, FALSE)),\"No\",\"Yes\")","v":"No"},1,null,"Zhao et al., 2014"]
["324-5p",{"$f":"IF(ISERROR(VLOOKUP(A221,AllValidatedAllAll!$A$2:$A$115, 1, FALSE)),\"No\",\"Yes\")","v":"No"},{"$f":"IF(ISERROR(VLOOKUP(A221,CandidateExactAllAll!$A$2:$A$84, 1, FALSE)),\"No\",\"Yes\")","v":"No"},1,null,"Zhao et al., 2014"]
["127-3p",{"$f":"IF(ISERROR(VLOOKUP(A222,AllValidatedAllAll!$A$2:$A$115, 1, FALSE)),\"No\",\"Yes\")","v":"No"},{"$f":"IF(ISERROR(VLOOKUP(A222,CandidateExactAllAll!$A$2:$A$84, 1, FALSE)),\"No\",\"Yes\")","v":"No"},1,null,"Zhao et al., 2014"]
["148a",{"$f":"IF(ISERROR(VLOOKUP(A223,AllValidatedAllAll!$A$2:$A$115, 1, FALSE)),\"No\",\"Yes\")","v":"No"},{"$f":"IF(ISERROR(VLOOKUP(A223,CandidateExactAllAll!$A$2:$A$84, 1, FALSE)),\"No\",\"Yes\")","v":"No"},1,null,"Zhao et al., 2014"]
[4270,{"$f":"IF(ISERROR(VLOOKUP(A224,AllValidatedAllAll!$A$2:$A$115, 1, FALSE)),\"No\",\"Yes\")","v":"No"},{"$f":"IF(ISERROR(VLOOKUP(A224,CandidateExactAllAll!$A$2:$A$84, 1, FALSE)),\"No\",\"Yes\")","v":"No"},1,null,"Zhao et al., 2014"]
["1225-5p",{"$f":"IF(ISERROR(VLOOKUP(A225,AllValidatedAllAll!$A$2:$A$115, 1, FALSE)),\"No\",\"Yes\")","v":"No"},{"$f":"IF(ISERROR(VLOOKUP(A225,CandidateExactAllAll!$A$2:$A$84, 1, FALSE)),\"No\",\"Yes\")","v":"No"},1,null,"Zhao et al., 2014"]
[1207,{"$f":"IF(ISERROR(VLOOKUP(A226,AllValidatedAllAll!$A$2:$A$115, 1, FALSE)),\"No\",\"Yes\")","v":"Yes"},{"$f":"IF(ISERROR(VLOOKUP(A226,CandidateExactAllAll!$A$2:$A$84, 1, FALSE)),\"No\",\"Yes\")","v":"No"},1,null,"Zhao et al., 2014"]
[1202,{"$f":"IF(ISERROR(VLOOKUP(A227,AllValidatedAllAll!$A$2:$A$115, 1, FALSE)),\"No\",\"Yes\")","v":"No"},{"$f":"IF(ISERROR(VLOOKUP(A227,CandidateExactAllAll!$A$2:$A$84, 1, FALSE)),\"No\",\"Yes\")","v":"No"},1,null,"Zhao et al., 2014"]
[2861,{"$f":"IF(ISERROR(VLOOKUP(A228,AllValidatedAllAll!$A$2:$A$115, 1, FALSE)),\"No\",\"Yes\")","v":"No"},{"$f":"IF(ISERROR(VLOOKUP(A228,CandidateExactAllAll!$A$2:$A$84, 1, FALSE)),\"No\",\"Yes\")","v":"No"},1,null,"Zhao et al., 2014"]
["483-5p",{"$f":"IF(ISERROR(VLOOKUP(A229,AllValidatedAllAll!$A$2:$A$115, 1, FALSE)),\"No\",\"Yes\")","v":"No"},{"$f":"IF(ISERROR(VLOOKUP(A229,CandidateExactAllAll!$A$2:$A$84, 1, FALSE)),\"No\",\"Yes\")","v":"No"},1,null,"Zhao et al., 2014"]
[575,{"$f":"IF(ISERROR(VLOOKUP(A230,AllValidatedAllAll!$A$2:$A$115, 1, FALSE)),\"No\",\"Yes\")","v":"No"},{"$f":"IF(ISERROR(VLOOKUP(A230,CandidateExactAllAll!$A$2:$A$84, 1, FALSE)),\"No\",\"Yes\")","v":"No"},1,null,"Zhao et al., 2014"]
[4327,{"$f":"IF(ISERROR(VLOOKUP(A231,AllValidatedAllAll!$A$2:$A$115, 1, FALSE)),\"No\",\"Yes\")","v":"No"},{"$f":"IF(ISERROR(VLOOKUP(A231,CandidateExactAllAll!$A$2:$A$84, 1, FALSE)),\"No\",\"Yes\")","v":"No"},1,null,"Zhao et al., 2014"]
[4298,{"$f":"IF(ISERROR(VLOOKUP(A232,AllValidatedAllAll!$A$2:$A$115, 1, FALSE)),\"No\",\"Yes\")","v":"No"},{"$f":"IF(ISERROR(VLOOKUP(A232,CandidateExactAllAll!$A$2:$A$84, 1, FALSE)),\"No\",\"Yes\")","v":"No"},1,null,"Zhao et al., 2014"]
["3679-5p",{"$f":"IF(ISERROR(VLOOKUP(A233,AllValidatedAllAll!$A$2:$A$115, 1, FALSE)),\"No\",\"Yes\")","v":"No"},{"$f":"IF(ISERROR(VLOOKUP(A233,CandidateExactAllAll!$A$2:$A$84, 1, FALSE)),\"No\",\"Yes\")","v":"No"},1,null,"Zhao et al., 2014"]
[1915,{"$f":"IF(ISERROR(VLOOKUP(A234,AllValidatedAllAll!$A$2:$A$115, 1, FALSE)),\"No\",\"Yes\")","v":"No"},{"$f":"IF(ISERROR(VLOOKUP(A234,CandidateExactAllAll!$A$2:$A$84, 1, FALSE)),\"No\",\"Yes\")","v":"No"},1,null,"Zhao et al., 2014"]
[132,{"$f":"IF(ISERROR(VLOOKUP(A235,AllValidatedAllAll!$A$2:$A$115, 1, FALSE)),\"No\",\"Yes\")","v":"No"},{"$f":"IF(ISERROR(VLOOKUP(A235,CandidateExactAllAll!$A$2:$A$84, 1, FALSE)),\"No\",\"Yes\")","v":"No"},1,null,"Zhao et al., 2014"]
[4281,{"$f":"IF(ISERROR(VLOOKUP(A236,AllValidatedAllAll!$A$2:$A$115, 1, FALSE)),\"No\",\"Yes\")","v":"No"},{"$f":"IF(ISERROR(VLOOKUP(A236,CandidateExactAllAll!$A$2:$A$84, 1, FALSE)),\"No\",\"Yes\")","v":"No"},1,null,"Zhao et al., 2014"]
["517*",{"$f":"IF(ISERROR(VLOOKUP(A237,AllValidatedAllAll!$A$2:$A$115, 1, FALSE)),\"No\",\"Yes\")","v":"Yes"},{"$f":"IF(ISERROR(VLOOKUP(A237,CandidateExactAllAll!$A$2:$A$84, 1, FALSE)),\"No\",\"Yes\")","v":"Yes"},1,null,"Zhu et al., 2009"]
["154*",{"$f":"IF(ISERROR(VLOOKUP(A238,AllValidatedAllAll!$A$2:$A$115, 1, FALSE)),\"No\",\"Yes\")","v":"No"},{"$f":"IF(ISERROR(VLOOKUP(A238,CandidateExactAllAll!$A$2:$A$84, 1, FALSE)),\"No\",\"Yes\")","v":"No"},1,null,"Zhu et al., 2009"]
[625,{"$f":"IF(ISERROR(VLOOKUP(A239,AllValidatedAllAll!$A$2:$A$115, 1, FALSE)),\"No\",\"Yes\")","v":"No"},{"$f":"IF(ISERROR(VLOOKUP(A239,CandidateExactAllAll!$A$2:$A$84, 1, FALSE)),\"No\",\"Yes\")","v":"No"},1,null,"Zhu et al., 2009"]
[150,{"$f":"IF(ISERROR(VLOOKUP(A240,AllValidatedAllAll!$A$2:$A$115, 1, FALSE)),\"No\",\"Yes\")","v":"No"},{"$f":"IF(ISERROR(VLOOKUP(A240,CandidateExactAllAll!$A$2:$A$84, 1, FALSE)),\"No\",\"Yes\")","v":"No"},1,null,"Zhu et al., 2009"]
[450,{"$f":"IF(ISERROR(VLOOKUP(A241,AllValidatedAllAll!$A$2:$A$115, 1, FALSE)),\"No\",\"Yes\")","v":"No"},{"$f":"IF(ISERROR(VLOOKUP(A241,CandidateExactAllAll!$A$2:$A$84, 1, FALSE)),\"No\",\"Yes\")","v":"No"},1,null,"Zhu et al., 2009"]
[374,{"$f":"IF(ISERROR(VLOOKUP(A242,AllValidatedAllAll!$A$2:$A$115, 1, FALSE)),\"No\",\"Yes\")","v":"No"},{"$f":"IF(ISERROR(VLOOKUP(A242,CandidateExactAllAll!$A$2:$A$84, 1, FALSE)),\"No\",\"Yes\")","v":"No"},1,null,"Zhu et al., 2009"]

{"sheet":"ScreenBaseAllAll","index":1,"n_rows":170,"n_cols":3,"rows_kept":170}
["microRNA","Cited","Studies (specific miRs discovered by study)"]
[518,14,"Guo et al., 2011 <518e,518b,518e> Ishibashi et al., 2012 <518f,518c> Li et al., 2013 <518c,518b> Mayor-Lynn et al., 2011 <518b> Ura et al., 2014 <518b> Xu et al., 2014 <518b> Yang et al., 2011 <518e> Yang et al., 2015 <518-3p,518e> Zhu et al., 2009 <518b>"]
[29,12,"Guo et al., 2011 <29a,29a,29c> Hu et al., 2009 <29b> Li et al., 2013 <29a,29c,29b> Wang, Y. et al. 2012 <29b> Yang et al., 2011 <29a> Yang et al., 2015 <29a> Zhang et al., 2015 <29a-3p> Zhao et al., 2014 <29b>"]
[223,10,"Betoni et al., 2013 <223> Choi et al., 2013 <223> Guo et al., 2011 <223> Li et al., 2013 <223> Mayor-Lynn et al., 2011 <223> Weedon-Fekjær al., 2014 <223-3p> Xu et al., 2014 <223> Yang et al., 2011 <223> Zhao et al., 2014 <223> Zhu et al., 2009 <223>"]
[517,10,"Guo et al., 2011 <517a,517c> Ishibashi et al., 2012 <517c> Li et al., 2013 <517b,517c> Mayor-Lynn et al., 2011 <517a> Yang et al., 2011 <517c,517b> Yang et al., 2015 <517c> Zhu et al., 2009 <517*>"]
[30,10,"Guo et al., 2011 <30d> Hu et al., 2009 <30e> Li et al., 2013 <30a,30b> Mayor-Lynn et al., 2011 <30d> Wang, Y. et al. 2012 <30a> Wu et al., 2012 <30d> Xu et al., 2014 <30a-3p> Zhao et al., 2014 <30a> Zhu et al., 2009 <30a-3p>"]
[519,10,"Hu et al., 2009 <519b-3p> Ishibashi et al., 2012 <519e*> Li et al., 2013 <519d,519a,519e> Xu et al., 2014 <519e*> Yang et al., 2011 <519d,519a> Yang et al., 2015 <519d> Zhu et al., 2009 <519e*>"]
[210,9,"Enquobahrie et al., 2011 <210> Ishibashi et al., 2012 <210> Jiang et al., 2015 <210> Pineles et al., 2007 <210> Ura et al., 2014 <210> Weedon-Fekjær al., 2014 <210> Xu et al., 2014 <210> Zhang et al., 2015 <210> Zhu et al., 2009 <210>"]
[520,8,"Betoni et al., 2013 <520f,520c-3p> Hu et al., 2009 <520g> Ishibashi et al., 2012 <520a-3p> Li et al., 2013 <520h> Ura et al., 2014 <520a> Yang et al., 2011 <520h,520g>"]
[126,8,"Guo et al., 2011 <126*> Hu et al., 2009 <126> Ishibashi et al., 2012 <126*> Jiang et al., 2015 <126> Ura et al., 2014 <126> Yang et al., 2015 <126,126*> Zhu et al., 2009 <126*>"]
[181,7,"Hu et al., 2009 <181a> Jiang et al., 2015 <181a> Mayor-Lynn et al., 2011 <181d> Wu et al., 2012 <181a> Xu et al., 2014 <181a> Zhang et al., 2015 <181a> Zhu et al., 2009 <181a>"]
[18,7,"Ishibashi et al., 2012 <18a> Li et al., 2013 <18a> Xu et al., 2014 <18a> Yang et al., 2015 <18a,18b> Zhu et al., 2009 <18a,18b>"]
[19,7,"Ishibashi et al., 2012 <19a> Li et al., 2013 <19a,19a,19b> Xu et al., 2014 <19a> Zhang et al., 2015 <19b> Zhu et al., 2009 <19a>"]
["let-7",7,"Li et al., 2013 <Let-7f> Mayor-Lynn et al., 2011 <let-7e> Noack et al., 2011 <Let-7b> Yang et al., 2011 <let-7f-1-star, let-7a-star, let-7f, let-7d> "]
[125,6,"Guo et al., 2011 <125b> Li et al., 2013 <125b,125a-5p> Yang et al., 2011 <125b,125a-5p> Zhang et al., 2015 <125b-1-3p>"]
[144,6,"Ishibashi et al., 2012 <144*> Li et al., 2013 <144*,144> Ura et al., 2014 <144> Wu et al., 2012 <144> Zhu et al., 2009 <144>"]
[182,6,"Jiang et al., 2015 <182,182> Li et al., 2013 <182> Noack et al., 2011 <182*> Pineles et al., 2007 <182> Zhang et al., 2015 <182>"]
[296,5,"Choi et al., 2013 <296-5p,296-3p> Ura et al., 2014 <296-5p> Xu et al., 2014 <296> Zhu et al., 2009 <296>"]
[26,5,"Choi et al., 2013 <26b,26a> Hu et al., 2009 <26b> Li et al., 2013 <26b> Wu et al., 2012 <26a>"]
[584,5,"Enquobahrie et al., 2011 <584> Jiang et al., 2015 <584> Xu et al., 2014 <584> Zhang et al., 2015 <584> Zhu et al., 2009 <584>"]
[130,5,"Guo et al., 2011 <130a> Li et al., 2013 <130a> Wu et al., 2012 <130a,130b> Yang et al., 2015 <130a>"]
[16,5,"Hu et al., 2009 <16> Wang, Y. et al. 2012 <16> Wu et al., 2012 <16> Zhang et al., 2015 <16> Zhao et al., 2014 <16>"]
[363,4,"Betoni et al., 2013 <363> Xu et al., 2014 <363> Zhang et al., 2015 <363> Zhu et al., 2009 <363>"]
[204,4,"Choi et al., 2013 <204> Ura et al., 2014 <204,204> Zhu et al., 2009 <204>"]
[525,4,"Guo et al., 2011 <525> Ishibashi et al., 2012 <525-5p> Li et al., 2013 <525-3p> Xu et al., 2014 <525*>"]
[335,4,"Hu et al., 2009 <335> Jiang et al., 2015 <335> Ura et al., 2014 <335> Zhang et al., 2015 <335>"]
[20,4,"Hu et al., 2009 <20b> Ishibashi et al., 2012 <20a> Wang, W. et al. 2012 <20b> Zhang et al., 2015 <20a>"]
[451,4,"Hu et al., 2009 <451> Ishibashi et al., 2012 <451> Jiang et al., 2015 <451a> Li et al., 2013 <451>"]
[193,4,"Ishibashi et al., 2012 <193b,193b*> Ura et al., 2014 <193a-3p> Xu et al., 2014 <193b>"]
[590,4,"Ishibashi et al., 2012 <590-5p> Xu et al., 2014 <590> Zhao et al., 2014 <590-5p> Zhu et al., 2009 <590>"]
[10,4,"Ishibashi et al., 2012 <10b> Li et al., 2013 <10a> Zhao et al., 2014 <10b> Zhu et al., 2009 <10b>"]
[146,4,"Ishibashi et al., 2012 <146b-5p> Mayor-Lynn et al., 2011 <146a,146b-5p> Wang, W. et al. 2012 <146a>"]
[376,4,"Ura et al., 2014 <376a> Zhao et al., 2014 <376a,376c,376a>"]
[23,3,"Akehurst et al., 2015 <23a*> Li et al., 2013 <23a,23b>"]
[196,3,"Akehurst et al., 2015 <196b-5p> Betoni et al., 2013 <196b> Jiang et al., 2015 <196>"]
[199,3,"Betoni et al., 2013 <199b-5p> Li et al., 2013 <199a-5p> Zhao et al., 2014 <199b-5p>"]
[140,3,"Betoni et al., 2013 <140-5p> Zhao et al., 2014 <140-3p,140-5p>"]
[101,3,"Betoni et al., 2013 <101> Li et al., 2013 <101> Zhu et al., 2009 <101>"]
[25,3,"Choi et al., 2013 <25> Li et al., 2013 <25> Ura et al., 2014 <25>"]
[21,3,"Choi et al., 2013 <21> Jiang et al., 2015 <21> Li et al., 2013 <21>"]
[34,3,"Enquobahrie et al., 2011 <34c-5p> Li et al., 2013 <34a> Wang, W. et al. 2012 <34c-5p>"]
[1,3,"Enquobahrie et al., 2011 <1> Zhang et al., 2015 <1> Zhu et al., 2009 <1>"]
[195,3,"Hu et al., 2009 <195> Xu et al., 2014 <195> Zhu et al., 2009 <195>"]
[27,3,"Hu et al., 2009 <27a> Li et al., 2013 <27a> Yang et al., 2015 <27a>"]
[214,3,"Hu et al., 2009 <214> Xu et al., 2014 <214> Zhao et al., 2014 <214>"]
[185,3,"Ishibashi et al., 2012 <185> Li et al., 2013 <185> Yang et al., 2011 <185>"]
[224,3,"Ishibashi et al., 2012 <224> Weedon-Fekjær al., 2014 <224-5p> Yang et al., 2015 <224>"]
[152,3,"Jiang et al., 2015 <152> Ura et al., 2014 <152> Zhu et al., 2009 <152>"]
[32,3,"Jiang et al., 2015 <32> Ura et al., 2014 <32> Zhu et al., 2009 <32>"]
[362,3,"Jiang et al., 2015 <362-3p> Xu et al., 2014 <362> Zhu et al., 2009 <362>"]
[221,3,"Li et al., 2013 <221> Wu et al., 2012 <221> Zhao et al., 2014 <221>"]
[15,3,"Li et al., 2013 <15b*,15b> Ura et al., 2014 <15b>"]
[24,3,"Li et al., 2013 <24> Mayor-Lynn et al., 2011 <24> Wu et al., 2012 <24>"]
[145,3,"Li et al., 2013 <145> Mayor-Lynn et al., 2011 <145*> Wu et al., 2012 <145>"]
[512,3,"Li et al., 2013 <512-5p> Mayor-Lynn et al., 2011 <512-3p> Wang, W. et al. 2012 <512-3p>"]
[151,3,"Wang, W. et al. 2012 <151-3p> Wu et al., 2012 <151-3p> Xu et al., 2014 <151>"]
[638,3,"Xu et al., 2014 <638> Zhao et al., 2014 <638> Zhu et al., 2009 <638>"]
[542,3,"Xu et al., 2014 <542-3p> Yang et al., 2011 <542-3p> Zhu et al., 2009 <542-3p>"]
[301,3,"Yang et al., 2015 <301a> Zhao et al., 2014 <301a,301a>"]
[7,2,"Betoni et al., 2013 <7> Hu et al., 2009 <7f>"]
[493,2,"Betoni et al., 2013 <493> Mayor-Lynn et al., 2011 <493>"]
[128,2,"Betoni et al., 2013 <128> Noack et al., 2011 <128a>"]
[342,2,"Choi et al., 2013 <342-3p> Wu et al., 2012 <342-3p>"]
[141,2,"Guo et al., 2011 <141> Hu et al., 2009 <141>"]
[22,2,"Guo et al., 2011 <22> Ishibashi et al., 2012 <22>"]
[149,2,"Guo et al., 2013 <149> Yang et al., 2015 <149>"]
[450,2,"Hu et al., 2009 <450a> Zhu et al., 2009 <450>"]
[142,2,"Ishibashi et al., 2012 <142-3p> Yang et al., 2015 <142-3p>"]
[526,2,"Ishibashi et al., 2012 <526b> Mayor-Lynn et al., 2011 <526b>"]
[17,2,"Jiang et al., 2015 <17> Xu et al., 2014 <17-3p>"]
[516,2,"Jiang et al., 2015 <516> Wang, W. et al. 2012 <516a-5p>"]
[135,2,"Jiang et al., 2015 <135a> Yang et al., 2015 <135b>"]
[377,2,"Jiang et al., 2015 <377> Zhu et al., 2009 <377>"]
[521,2,"Li et al., 2013 <521> Yang et al., 2011 <521>"]
[378,2,"Li et al., 2013 <378> Mayor-Lynn et al., 2011 <378>"]
[515,2,"Li et al., 2013 <515-3p> Xu et al., 2014 <515-3p>"]
[424,2,"Li et al., 2013 <424> Zhang et al., 2015 <424>"]
[100,2,"Li et al., 2013 <100> Zhao et al., 2014 <100>"]
[99,2,"Li et al., 2013 <99a> Zhao et al., 2014 <99a>"]
[320,2,"Li et al., 2013 <320c> Yang et al., 2011 <320c>"]
[495,2,"Mayor-Lynn et al., 2011 <495> Zhao et al., 2014 <495>"]
[524,2,"Wang, W. et al. 2012 <524-3p> Xu et al., 2014 <524>"]
[31,2,"Xu et al., 2014 <31> Zhao et al., 2014 <31>"]
[218,2,"Xu et al., 2014 <218> Zhu et al., 2009 <218>"]
[411,2,"Xu et al., 2014 <411> Zhu et al., 2009 <411>"]
[136,2,"Yang et al., 2011 <136> Zhao et al., 2014 <136>"]
[2861,2,"Zhao et al., 2014 <2861,2861>"]
[206,1,"Akehurst et al., 2015 <206-5p>"]
[502,1,"Akehurst et al., 2015 <502-5p>"]
[503,1,"Akehurst et al., 2015 <503-5p>"]
[758,1,"Akehurst et al., 2015 <758-3p>"]
[585,1,"Betoni et al., 2013 <585>"]
[551,1,"Betoni et al., 2013 <551b>"]
[92,1,"Choi et al., 2013 <92b>"]
[197,1,"Choi et al., 2013 <197>"]
[198,1,"Choi et al., 2013 <198>"]
[202,1,"Choi et al., 2013 <202>"]
[191,1,"Choi et al., 2013 <191>"]
[95,1,"Choi et al., 2013 <95>"]
[328,1,"Enquobahrie et al., 2011 <328>"]
[139,1,"Enquobahrie et al., 2011 <139-5p>"]
[500,1,"Enquobahrie et al., 2011 <500>"]
[1247,1,"Enquobahrie et al., 2011 <1247>"]
[143,1,"Guo et al., 2011 <143>"]
[194,1,"Guo et al., 2013 <194>"]
[222,1,"Hu et al., 2009 <222>"]
[565,1,"Hu et al., 2009 <565>"]
[522,1,"Hu et al., 2009 <522>"]
[486,1,"Hu et al., 2009 <486-3p>"]
[658,1,"Hu et al., 2009 <658>"]
[523,1,"Hu et al., 2009 <523-3p>"]
[423,1,"Hu et al., 2009 <423-5p>"]
[491,1,"Hu et al., 2009 <491-5p>"]
[612,1,"Hu et al., 2009 <612>"]
[508,1,"Hu et al., 2009 <508-5p>"]
[96,1,"Jiang et al., 2015 <96>"]
[114,1,"Li et al., 2013 <114>"]
[299,1,"Li et al., 2013 <299a-5p>"]
[107,1,"Li et al., 2013 <107>"]
[496,1,"Mayor-Lynn et al., 2011 <496>"]
[431,1,"Mayor-Lynn et al., 2011 <431>"]
[720,1,"Mayor-Lynn et al., 2011 <720>"]
[654,1,"Mayor-Lynn et al., 2011 <654-3p>"]
[539,1,"Mayor-Lynn et al., 2011 <539>"]
[302,1,"Noack et al., 2011 <302*>"]
[104,1,"Noack et al., 2011 <104>"]
[133,1,"Noack et al., 2011 <133b>"]
[1233,1,"Ura et al., 2014 <1233>"]
[650,1,"Ura et al., 2014 <650>"]
[215,1,"Ura et al., 2014 <215>"]
[668,1,"Ura et al., 2014 <668>"]
[2277,1,"Wang, W. et al. 2012 <2277>"]
[192,1,"Wang, W. et al. 2012 <192>"]
[1301,1,"Weedon-Fekjær al., 2014 <1301>"]
[574,1,"Wu et al., 2012 <574-5p>"]
[103,1,"Wu et al., 2012 <103>"]
[425,1,"Wu et al., 2012 <425>"]
[379,1,"Xu et al., 2014 <379>"]
[1260,1,"Yang et al., 2011 <1260>"]
[1272,1,"Yang et al., 2011 <1272>"]
[188,1,"Yang et al., 2015 <188-5p>"]
[203,1,"Yang et al., 2015 <203>"]
[205,1,"Yang et al., 2015 <205>"]
[93,1,"Yang et al., 2015 <93>"]
[355,1,"Zhang et al., 2015 <355>"]
[1469,1,"Zhang et al., 2015 <1469>"]
[200,1,"Zhang et al., 2015 <200c>"]
[744,1,"Zhang et al., 2015 <744>"]
[1826,1,"Zhang et al., 2015 <1826>"]
[494,1,"Zhao et al., 2014 <494>"]
[4324,1,"Zhao et al., 2014 <4324>"]
[324,1,"Zhao et al., 2014 <324-5p>"]
[127,1,"Zhao et al., 2014 <127-3p>"]
[148,1,"Zhao et al., 2014 <148a>"]
[4270,1,"Zhao et al., 2014 <4270>"]
[1225,1,"Zhao et al., 2014 <1225-5p>"]
[1207,1,"Zhao et al., 2014 <1207>"]
[1202,1,"Zhao et al., 2014 <1202>"]
[483,1,"Zhao et al., 2014 <483-5p>"]
[575,1,"Zhao et al., 2014 <575>"]
[4327,1,"Zhao et al., 2014 <4327>"]
[4298,1,"Zhao et al., 2014 <4298>"]
[3679,1,"Zhao et al., 2014 <3679-5p>"]
[1915,1,"Zhao et al., 2014 <1915>"]
[132,1,"Zhao et al., 2014 <132>"]
[4281,1,"Zhao et al., 2014 <4281>"]
[154,1,"Zhu et al., 2009 <154*>"]
[625,1,"Zhu et al., 2009 <625>"]
[150,1,"Zhu et al., 2009 <150>"]
[374,1,"Zhu et al., 2009 <374>"]

{"sheet":"ScreenArmlesssAllAll","index":2,"n_rows":215,"n_cols":3,"rows_kept":215}
["microRNA","Cited","Studies"]
[223,10,"Betoni et al., 2013, Choi et al., 2013, Guo et al., 2011, Li et al., 2013, Mayor-Lynn et al., 2011, Weedon-Fekjær al., 2014, Xu et al., 2014, Yang et al., 2011, Zhao et al., 2014, Zhu et al., 2009"]
[210,9,"Enquobahrie et al., 2011, Ishibashi et al., 2012, Jiang et al., 2015, Pineles et al., 2007, Ura et al., 2014, Weedon-Fekjær al., 2014, Xu et al., 2014, Zhang et al., 2015, Zhu et al., 2009"]
[126,7,"Guo et al., 2011, Hu et al., 2009, Ishibashi et al., 2012, Jiang et al., 2015, Ura et al., 2014, Yang et al., 2015, Zhu et al., 2009"]
["518b",6,"Guo et al., 2011, Li et al., 2013, Mayor-Lynn et al., 2011, Ura et al., 2014, Xu et al., 2014, Zhu et al., 2009"]
["181a",6,"Hu et al., 2009, Jiang et al., 2015, Wu et al., 2012, Xu et al., 2014, Zhang et al., 2015, Zhu et al., 2009"]
[584,5,"Enquobahrie et al., 2011, Jiang et al., 2015, Xu et al., 2014, Zhang et al., 2015, Zhu et al., 2009"]
["29a",5,"Guo et al., 2011, Li et al., 2013, Yang et al., 2011, Yang et al., 2015, Zhang et al., 2015"]
["517c",5,"Guo et al., 2011, Ishibashi et al., 2012, Li et al., 2013, Yang et al., 2011, Yang et al., 2015"]
[16,5,"Hu et al., 2009, Wang, Y. et al. 2012, Wu et al., 2012, Zhang et al., 2015, Zhao et al., 2014"]
[144,5,"Ishibashi et al., 2012, Li et al., 2013, Ura et al., 2014, Wu et al., 2012, Zhu et al., 2009"]
["18a",5,"Ishibashi et al., 2012, Li et al., 2013, Xu et al., 2014, Yang et al., 2015, Zhu et al., 2009"]
[182,5,"Jiang et al., 2015, Li et al., 2013, Noack et al., 2011, Pineles et al., 2007, Zhang et al., 2015"]
["30a",5,"Li et al., 2013, Wang, Y. et al. 2012, Xu et al., 2014, Zhao et al., 2014, Zhu et al., 2009"]
[363,4,"Betoni et al., 2013, Xu et al., 2014, Zhang et al., 2015, Zhu et al., 2009"]
[296,4,"Choi et al., 2013, Ura et al., 2014, Xu et al., 2014, Zhu et al., 2009"]
["125b",4,"Guo et al., 2011, Li et al., 2013, Yang et al., 2011, Zhang et al., 2015"]
["130a",4,"Guo et al., 2011, Li et al., 2013, Wu et al., 2012, Yang et al., 2015"]
[525,4,"Guo et al., 2011, Ishibashi et al., 2012, Li et al., 2013, Xu et al., 2014"]
["29b",4,"Hu et al., 2009, Li et al., 2013, Wang, Y. et al. 2012, Zhao et al., 2014"]
[335,4,"Hu et al., 2009, Jiang et al., 2015, Ura et al., 2014, Zhang et al., 2015"]
["19a",4,"Ishibashi et al., 2012, Li et al., 2013, Xu et al., 2014, Zhu et al., 2009"]
[590,4,"Ishibashi et al., 2012, Xu et al., 2014, Zhao et al., 2014, Zhu et al., 2009"]
["519e",4,"Ishibashi et al., 2012, Li et al., 2013, Xu et al., 2014, Zhu et al., 2009"]
[101,3,"Betoni et al., 2013, Li et al., 2013, Zhu et al., 2009"]
["26b",3,"Choi et al., 2013, Hu et al., 2009, Li et al., 2013"]
[25,3,"Choi et al., 2013, Li et al., 2013, Ura et al., 2014"]
[204,3,"Choi et al., 2013, Ura et al., 2014, Zhu et al., 2009"]
[21,3,"Choi et al., 2013, Jiang et al., 2015, Li et al., 2013"]
[1,3,"Enquobahrie et al., 2011, Zhang et al., 2015, Zhu et al., 2009"]
["518e",3,"Guo et al., 2011, Yang et al., 2011, Yang et al., 2015"]
["30d",3,"Guo et al., 2011, Mayor-Lynn et al., 2011, Wu et al., 2012"]
[195,3,"Hu et al., 2009, Xu et al., 2014, Zhu et al., 2009"]
["27a",3,"Hu et al., 2009, Li et al., 2013, Yang et al., 2015"]
[451,3,"Hu et al., 2009, Ishibashi et al., 2012, Li et al., 2013"]
[214,3,"Hu et al., 2009, Xu et al., 2014, Zhao et al., 2014"]
[185,3,"Ishibashi et al., 2012, Li et al., 2013, Yang et al., 2011"]
["10b",3,"Ishibashi et al., 2012, Zhao et al., 2014, Zhu et al., 2009"]
[224,3,"Ishibashi et al., 2012, Weedon-Fekjær al., 2014, Yang et al., 2015"]
[152,3,"Jiang et al., 2015, Ura et al., 2014, Zhu et al., 2009"]
[32,3,"Jiang et al., 2015, Ura et al., 2014, Zhu et al., 2009"]
[362,3,"Jiang et al., 2015, Xu et al., 2014, Zhu et al., 2009"]
["519d",3,"Li et al., 2013, Yang et al., 2011, Yang et al., 2015"]
[221,3,"Li et al., 2013, Wu et al., 2012, Zhao et al., 2014"]
[24,3,"Li et al., 2013, Mayor-Lynn et al., 2011, Wu et al., 2012"]
[145,3,"Li et al., 2013, Mayor-Lynn et al., 2011, Wu et al., 2012"]
[512,3,"Li et al., 2013, Mayor-Lynn et al., 2011, Wang, W. et al. 2012"]
[151,3,"Wang, W. et al. 2012, Wu et al., 2012, Xu et al., 2014"]
[638,3,"Xu et al., 2014, Zhao et al., 2014, Zhu et al., 2009"]
[542,3,"Xu et al., 2014, Yang et al., 2011, Zhu et al., 2009"]
["23a",2,"Akehurst et al., 2015, Li et al., 2013"]
["196b",2,"Akehurst et al., 2015, Betoni et al., 2013"]
["199b",2,"Betoni et al., 2013, Zhao et al., 2014"]
[493,2,"Betoni et al., 2013, Mayor-Lynn et al., 2011"]
[140,2,"Betoni et al., 2013, Zhao et al., 2014"]
[342,2,"Choi et al., 2013, Wu et al., 2012"]
["26a",2,"Choi et al., 2013, Wu et al., 2012"]
["34c",2,"Enquobahrie et al., 2011, Wang, W. et al. 2012"]
[141,2,"Guo et al., 2011, Hu et al., 2009"]
["517a",2,"Guo et al., 2011, Mayor-Lynn et al., 2011"]
[22,2,"Guo et al., 2011, Ishibashi et al., 2012"]
["29c",2,"Guo et al., 2011, Li et al., 2013"]
[149,2,"Guo et al., 2013, Yang et al., 2015"]
["20b",2,"Hu et al., 2009, Wang, W. et al. 2012"]
["520g",2,"Hu et al., 2009, Yang et al., 2011"]
["193b",2,"Ishibashi et al., 2012, Xu et al., 2014"]
[142,2,"Ishibashi et al., 2012, Yang et al., 2015"]
["526b",2,"Ishibashi et al., 2012, Mayor-Lynn et al., 2011"]
["520a",2,"Ishibashi et al., 2012, Ura et al., 2014"]
["20a",2,"Ishibashi et al., 2012, Zhang et al., 2015"]
["146b",2,"Ishibashi et al., 2012, Mayor-Lynn et al., 2011"]
["518c",2,"Ishibashi et al., 2012, Li et al., 2013"]
[17,2,"Jiang et al., 2015, Xu et al., 2014"]
[377,2,"Jiang et al., 2015, Zhu et al., 2009"]
["517b",2,"Li et al., 2013, Yang et al., 2011"]
[521,2,"Li et al., 2013, Yang et al., 2011"]
[378,2,"Li et al., 2013, Mayor-Lynn et al., 2011"]
["519a",2,"Li et al., 2013, Yang et al., 2011"]
["520h",2,"Li et al., 2013, Yang et al., 2011"]
["125a",2,"Li et al., 2013, Yang et al., 2011"]
["15b",2,"Li et al., 2013, Ura et al., 2014"]
[515,2,"Li et al., 2013, Xu et al., 2014"]
[424,2,"Li et al., 2013, Zhang et al., 2015"]
[100,2,"Li et al., 2013, Zhao et al., 2014"]
["99a",2,"Li et al., 2013, Zhao et al., 2014"]
["19b",2,"Li et al., 2013, Zhang et al., 2015"]
["320c",2,"Li et al., 2013, Yang et al., 2011"]
["let-7f",2,"Li et al., 2013, Yang et al., 2011"]
["146a",2,"Mayor-Lynn et al., 2011, Wang, W. et al. 2012"]
[495,2,"Mayor-Lynn et al., 2011, Zhao et al., 2014"]
["376a",2,"Ura et al., 2014, Zhao et al., 2014"]
[524,2,"Wang, W. et al. 2012, Xu et al., 2014"]
[31,2,"Xu et al., 2014, Zhao et al., 2014"]
[218,2,"Xu et al., 2014, Zhu et al., 2009"]
[411,2,"Xu et al., 2014, Zhu et al., 2009"]
[136,2,"Yang et al., 2011, Zhao et al., 2014"]
["18b",2,"Yang et al., 2015, Zhu et al., 2009"]
["301a",2,"Yang et al., 2015, Zhao et al., 2014"]
[206,1,"Akehurst et al., 2015"]
[502,1,"Akehurst et al., 2015"]
[503,1,"Akehurst et al., 2015"]
[758,1,"Akehurst et al., 2015"]
[7,1,"Betoni et al., 2013"]
[585,1,"Betoni et al., 2013"]
["520f",1,"Betoni et al., 2013"]
["520c",1,"Betoni et al., 2013"]
[128,1,"Betoni et al., 2013"]
["551b",1,"Betoni et al., 2013"]
["92b",1,"Choi et al., 2013"]
[197,1,"Choi et al., 2013"]
[198,1,"Choi et al., 2013"]
[202,1,"Choi et al., 2013"]
[191,1,"Choi et al., 2013"]
[95,1,"Choi et al., 2013"]
[328,1,"Enquobahrie et al., 2011"]
[139,1,"Enquobahrie et al., 2011"]
[500,1,"Enquobahrie et al., 2011"]
[1247,1,"Enquobahrie et al., 2011"]
[143,1,"Guo et al., 2011"]
[194,1,"Guo et al., 2013"]
[222,1,"Hu et al., 2009"]
["7f",1,"Hu et al., 2009"]
[565,1,"Hu et al., 2009"]
["519b",1,"Hu et al., 2009"]
["450a",1,"Hu et al., 2009"]
["30e",1,"Hu et al., 2009"]
[522,1,"Hu et al., 2009"]
[486,1,"Hu et al., 2009"]
[658,1,"Hu et al., 2009"]
[523,1,"Hu et al., 2009"]
[423,1,"Hu et al., 2009"]
[491,1,"Hu et al., 2009"]
[612,1,"Hu et al., 2009"]
[508,1,"Hu et al., 2009"]
["518f",1,"Ishibashi et al., 2012"]
["451a",1,"Jiang et al., 2015"]
[516,1,"Jiang et al., 2015"]
["135a",1,"Jiang et al., 2015"]
[96,1,"Jiang et al., 2015"]
[196,1,"Jiang et al., 2015"]
["10a",1,"Li et al., 2013"]
[114,1,"Li et al., 2013"]
["299a",1,"Li et al., 2013"]
["23b",1,"Li et al., 2013"]
["34a",1,"Li et al., 2013"]
["199a",1,"Li et al., 2013"]
["30b",1,"Li et al., 2013"]
[107,1,"Li et al., 2013"]
[496,1,"Mayor-Lynn et al., 2011"]
[431,1,"Mayor-Lynn et al., 2011"]
[720,1,"Mayor-Lynn et al., 2011"]
[654,1,"Mayor-Lynn et al., 2011"]
["181d",1,"Mayor-Lynn et al., 2011"]
[539,1,"Mayor-Lynn et al., 2011"]
["let-7e",1,"Mayor-Lynn et al., 2011"]
["let-7b",1,"Noack et al., 2011"]
[302,1,"Noack et al., 2011"]
[104,1,"Noack et al., 2011"]
["128a",1,"Noack et al., 2011"]
["133b",1,"Noack et al., 2011"]
[1233,1,"Ura et al., 2014"]
[650,1,"Ura et al., 2014"]
[215,1,"Ura et al., 2014"]
["193a",1,"Ura et al., 2014"]
[668,1,"Ura et al., 2014"]
["516a",1,"Wang, W. et al. 2012"]
[2277,1,"Wang, W. et al. 2012"]
[192,1,"Wang, W. et al. 2012"]
[1301,1,"Weedon-Fekjær al., 2014"]
[574,1,"Wu et al., 2012"]
["130b",1,"Wu et al., 2012"]
[103,1,"Wu et al., 2012"]
[425,1,"Wu et al., 2012"]
[379,1,"Xu et al., 2014"]
["let-7f-1-star",1,"Yang et al., 2011"]
["let-7a-star",1,"Yang et al., 2011"]
[1260,1,"Yang et al., 2011"]
["let-7d",1,"Yang et al., 2011"]
[1272,1,"Yang et al., 2011"]
["135b",1,"Yang et al., 2015"]
[188,1,"Yang et al., 2015"]
[203,1,"Yang et al., 2015"]
[205,1,"Yang et al., 2015"]
[518,1,"Yang et al., 2015"]
[93,1,"Yang et al., 2015"]
[355,1,"Zhang et al., 2015"]
[1469,1,"Zhang et al., 2015"]
["200c",1,"Zhang et al., 2015"]
[744,1,"Zhang et al., 2015"]
[1826,1,"Zhang et al., 2015"]
[494,1,"Zhao et al., 2014"]
["376c",1,"Zhao et al., 2014"]
[4324,1,"Zhao et al., 2014"]
[324,1,"Zhao et al., 2014"]
[127,1,"Zhao et al., 2014"]
["148a",1,"Zhao et al., 2014"]
[4270,1,"Zhao et al., 2014"]
[1225,1,"Zhao et al., 2014"]
[1207,1,"Zhao et al., 2014"]
[1202,1,"Zhao et al., 2014"]
[2861,1,"Zhao et al., 2014"]
[483,1,"Zhao et al., 2014"]
[575,1,"Zhao et al., 2014"]
[4327,1,"Zhao et al., 2014"]
[4298,1,"Zhao et al., 2014"]
[3679,1,"Zhao et al., 2014"]
[1915,1,"Zhao et al., 2014"]
[132,1,"Zhao et al., 2014"]
[4281,1,"Zhao et al., 2014"]
[517,1,"Zhu et al., 2009"]
[154,1,"Zhu et al., 2009"]
[625,1,"Zhu et al., 2009"]
[150,1,"Zhu et al., 2009"]
[450,1,"Zhu et al., 2009"]
[374,1,"Zhu et al., 2009"]

{"sheet":"ScreenExactPlacentaAll","index":3,"n_rows":173,"n_cols":4,"rows_kept":173}
["microRNA","In Circulation?","Cited","Studies"]
[210,{"$f":"IF(ISERROR(VLOOKUP(A2,AllExactCirculationAll!$A$2:$A$152, 1, FALSE)),\"No\",\"Yes\")","v":"Yes"},8,"Enquobahrie et al., 2011, Ishibashi et al., 2012, Jiang et al., 2015, Pineles et al., 2007, Weedon-Fekjær al., 2014, Xu et al., 2014, Zhang et al., 2015, Zhu et al., 2009"]
[223,{"$f":"IF(ISERROR(VLOOKUP(A3,AllExactCirculationAll!$A$2:$A$152, 1, FALSE)),\"No\",\"Yes\")","v":"Yes"},6,"Betoni et al., 2013, Choi et al., 2013, Guo et al., 2011, Mayor-Lynn et al., 2011, Xu et al., 2014, Zhu et al., 2009"]
["181a",{"$f":"IF(ISERROR(VLOOKUP(A4,AllExactCirculationAll!$A$2:$A$152, 1, FALSE)),\"No\",\"Yes\")","v":"Yes"},5,"Hu et al., 2009, Jiang et al., 2015, Xu et al., 2014, Zhang et al., 2015, Zhu et al., 2009"]
["126*",{"$f":"IF(ISERROR(VLOOKUP(A5,AllExactCirculationAll!$A$2:$A$152, 1, FALSE)),\"No\",\"Yes\")","v":"Yes"},4,"Guo et al., 2011, Ishibashi et al., 2012, Yang et al., 2015, Zhu et al., 2009"]
["518b",{"$f":"IF(ISERROR(VLOOKUP(A6,AllExactCirculationAll!$A$2:$A$152, 1, FALSE)),\"No\",\"Yes\")","v":"Yes"},4,"Guo et al., 2011, Mayor-Lynn et al., 2011, Xu et al., 2014, Zhu et al., 2009"]
["18a",{"$f":"IF(ISERROR(VLOOKUP(A7,AllExactCirculationAll!$A$2:$A$152, 1, FALSE)),\"No\",\"Yes\")","v":"Yes"},4,"Ishibashi et al., 2012, Xu et al., 2014, Yang et al., 2015, Zhu et al., 2009"]
["517c",{"$f":"IF(ISERROR(VLOOKUP(A8,AllExactCirculationAll!$A$2:$A$152, 1, FALSE)),\"No\",\"Yes\")","v":"Yes"},3,"Guo et al., 2011, Ishibashi et al., 2012, Yang et al., 2015"]
[335,{"$f":"IF(ISERROR(VLOOKUP(A9,AllExactCirculationAll!$A$2:$A$152, 1, FALSE)),\"No\",\"Yes\")","v":"Yes"},3,"Hu et al., 2009, Jiang et al., 2015, Zhang et al., 2015"]
[126,{"$f":"IF(ISERROR(VLOOKUP(A10,AllExactCirculationAll!$A$2:$A$152, 1, FALSE)),\"No\",\"Yes\")","v":"Yes"},3,"Hu et al., 2009, Jiang et al., 2015, Yang et al., 2015"]
["19a",{"$f":"IF(ISERROR(VLOOKUP(A11,AllExactCirculationAll!$A$2:$A$152, 1, FALSE)),\"No\",\"Yes\")","v":"Yes"},3,"Ishibashi et al., 2012, Xu et al., 2014, Zhu et al., 2009"]
["519e*",{"$f":"IF(ISERROR(VLOOKUP(A12,AllExactCirculationAll!$A$2:$A$152, 1, FALSE)),\"No\",\"Yes\")","v":"Yes"},3,"Ishibashi et al., 2012, Xu et al., 2014, Zhu et al., 2009"]
[182,{"$f":"IF(ISERROR(VLOOKUP(A13,AllExactCirculationAll!$A$2:$A$152, 1, FALSE)),\"No\",\"Yes\")","v":"Yes"},3,"Jiang et al., 2015, Pineles et al., 2007, Zhang et al., 2015"]
[101,{"$f":"IF(ISERROR(VLOOKUP(A14,AllExactCirculationAll!$A$2:$A$152, 1, FALSE)),\"No\",\"Yes\")","v":"Yes"},2,"Betoni et al., 2013, Zhu et al., 2009"]
["26b",{"$f":"IF(ISERROR(VLOOKUP(A15,AllExactCirculationAll!$A$2:$A$152, 1, FALSE)),\"No\",\"Yes\")","v":"Yes"},2,"Choi et al., 2013, Hu et al., 2009"]
[204,{"$f":"IF(ISERROR(VLOOKUP(A16,AllExactCirculationAll!$A$2:$A$152, 1, FALSE)),\"No\",\"Yes\")","v":"Yes"},2,"Choi et al., 2013, Zhu et al., 2009"]
[21,{"$f":"IF(ISERROR(VLOOKUP(A17,AllExactCirculationAll!$A$2:$A$152, 1, FALSE)),\"No\",\"Yes\")","v":"Yes"},2,"Choi et al., 2013, Jiang et al., 2015"]
["130a",{"$f":"IF(ISERROR(VLOOKUP(A18,AllExactCirculationAll!$A$2:$A$152, 1, FALSE)),\"No\",\"Yes\")","v":"Yes"},2,"Guo et al., 2011, Yang et al., 2015"]
["29a",{"$f":"IF(ISERROR(VLOOKUP(A19,AllExactCirculationAll!$A$2:$A$152, 1, FALSE)),\"No\",\"Yes\")","v":"Yes"},2,"Guo et al., 2011, Yang et al., 2015"]
["518e",{"$f":"IF(ISERROR(VLOOKUP(A20,AllExactCirculationAll!$A$2:$A$152, 1, FALSE)),\"No\",\"Yes\")","v":"Yes"},2,"Guo et al., 2011, Yang et al., 2015"]
["30d",{"$f":"IF(ISERROR(VLOOKUP(A21,AllExactCirculationAll!$A$2:$A$152, 1, FALSE)),\"No\",\"Yes\")","v":"Yes"},2,"Guo et al., 2011, Mayor-Lynn et al., 2011"]
[149,{"$f":"IF(ISERROR(VLOOKUP(A22,AllExactCirculationAll!$A$2:$A$152, 1, FALSE)),\"No\",\"Yes\")","v":"Yes"},2,"Guo et al., 2013, Yang et al., 2015"]
[16,{"$f":"IF(ISERROR(VLOOKUP(A23,AllExactCirculationAll!$A$2:$A$152, 1, FALSE)),\"No\",\"Yes\")","v":"Yes"},2,"Hu et al., 2009, Zhang et al., 2015"]
["27a",{"$f":"IF(ISERROR(VLOOKUP(A24,AllExactCirculationAll!$A$2:$A$152, 1, FALSE)),\"No\",\"Yes\")","v":"Yes"},2,"Hu et al., 2009, Yang et al., 2015"]
[451,{"$f":"IF(ISERROR(VLOOKUP(A25,AllExactCirculationAll!$A$2:$A$152, 1, FALSE)),\"No\",\"Yes\")","v":"Yes"},2,"Hu et al., 2009, Ishibashi et al., 2012"]
["142-3p",{"$f":"IF(ISERROR(VLOOKUP(A26,AllExactCirculationAll!$A$2:$A$152, 1, FALSE)),\"No\",\"Yes\")","v":"Yes"},2,"Ishibashi et al., 2012, Yang et al., 2015"]
[224,{"$f":"IF(ISERROR(VLOOKUP(A27,AllExactCirculationAll!$A$2:$A$152, 1, FALSE)),\"No\",\"Yes\")","v":"Yes"},2,"Ishibashi et al., 2012, Yang et al., 2015"]
[152,{"$f":"IF(ISERROR(VLOOKUP(A28,AllExactCirculationAll!$A$2:$A$152, 1, FALSE)),\"No\",\"Yes\")","v":"Yes"},2,"Jiang et al., 2015, Zhu et al., 2009"]
[32,{"$f":"IF(ISERROR(VLOOKUP(A29,AllExactCirculationAll!$A$2:$A$152, 1, FALSE)),\"No\",\"Yes\")","v":"Yes"},2,"Jiang et al., 2015, Zhu et al., 2009"]
["542-3p",{"$f":"IF(ISERROR(VLOOKUP(A30,AllExactCirculationAll!$A$2:$A$152, 1, FALSE)),\"No\",\"Yes\")","v":"Yes"},2,"Xu et al., 2014, Zhu et al., 2009"]
["18b",{"$f":"IF(ISERROR(VLOOKUP(A31,AllExactCirculationAll!$A$2:$A$152, 1, FALSE)),\"No\",\"Yes\")","v":"Yes"},2,"Yang et al., 2015, Zhu et al., 2009"]
["342-3p",{"$f":"IF(ISERROR(VLOOKUP(A32,AllExactCirculationAll!$A$2:$A$152, 1, FALSE)),\"No\",\"Yes\")","v":"Yes"},1,"Choi et al., 2013"]
["296-5p",{"$f":"IF(ISERROR(VLOOKUP(A33,AllExactCirculationAll!$A$2:$A$152, 1, FALSE)),\"No\",\"Yes\")","v":"Yes"},1,"Choi et al., 2013"]
[25,{"$f":"IF(ISERROR(VLOOKUP(A34,AllExactCirculationAll!$A$2:$A$152, 1, FALSE)),\"No\",\"Yes\")","v":"Yes"},1,"Choi et al., 2013"]
["26a",{"$f":"IF(ISERROR(VLOOKUP(A35,AllExactCirculationAll!$A$2:$A$152, 1, FALSE)),\"No\",\"Yes\")","v":"Yes"},1,"Choi et al., 2013"]
["125b",{"$f":"IF(ISERROR(VLOOKUP(A36,AllExactCirculationAll!$A$2:$A$152, 1, FALSE)),\"No\",\"Yes\")","v":"Yes"},1,"Guo et al., 2011"]
["29c",{"$f":"IF(ISERROR(VLOOKUP(A37,AllExactCirculationAll!$A$2:$A$152, 1, FALSE)),\"No\",\"Yes\")","v":"Yes"},1,"Guo et al., 2011"]
["29b",{"$f":"IF(ISERROR(VLOOKUP(A38,AllExactCirculationAll!$A$2:$A$152, 1, FALSE)),\"No\",\"Yes\")","v":"Yes"},1,"Hu et al., 2009"]
["520g",{"$f":"IF(ISERROR(VLOOKUP(A39,AllExactCirculationAll!$A$2:$A$152, 1, FALSE)),\"No\",\"Yes\")","v":"Yes"},1,"Hu et al., 2009"]
["144*",{"$f":"IF(ISERROR(VLOOKUP(A40,AllExactCirculationAll!$A$2:$A$152, 1, FALSE)),\"No\",\"Yes\")","v":"Yes"},1,"Ishibashi et al., 2012"]
[185,{"$f":"IF(ISERROR(VLOOKUP(A41,AllExactCirculationAll!$A$2:$A$152, 1, FALSE)),\"No\",\"Yes\")","v":"Yes"},1,"Ishibashi et al., 2012"]
["518c",{"$f":"IF(ISERROR(VLOOKUP(A42,AllExactCirculationAll!$A$2:$A$152, 1, FALSE)),\"No\",\"Yes\")","v":"Yes"},1,"Ishibashi et al., 2012"]
[378,{"$f":"IF(ISERROR(VLOOKUP(A43,AllExactCirculationAll!$A$2:$A$152, 1, FALSE)),\"No\",\"Yes\")","v":"Yes"},1,"Mayor-Lynn et al., 2011"]
[24,{"$f":"IF(ISERROR(VLOOKUP(A44,AllExactCirculationAll!$A$2:$A$152, 1, FALSE)),\"No\",\"Yes\")","v":"Yes"},1,"Mayor-Lynn et al., 2011"]
["151-3p",{"$f":"IF(ISERROR(VLOOKUP(A45,AllExactCirculationAll!$A$2:$A$152, 1, FALSE)),\"No\",\"Yes\")","v":"Yes"},1,"Wang, W. et al. 2012"]
["525*",{"$f":"IF(ISERROR(VLOOKUP(A46,AllExactCirculationAll!$A$2:$A$152, 1, FALSE)),\"No\",\"Yes\")","v":"Yes"},1,"Xu et al., 2014"]
["515-3p",{"$f":"IF(ISERROR(VLOOKUP(A47,AllExactCirculationAll!$A$2:$A$152, 1, FALSE)),\"No\",\"Yes\")","v":"Yes"},1,"Xu et al., 2014"]
["135b",{"$f":"IF(ISERROR(VLOOKUP(A48,AllExactCirculationAll!$A$2:$A$152, 1, FALSE)),\"No\",\"Yes\")","v":"Yes"},1,"Yang et al., 2015"]
["188-5p",{"$f":"IF(ISERROR(VLOOKUP(A49,AllExactCirculationAll!$A$2:$A$152, 1, FALSE)),\"No\",\"Yes\")","v":"Yes"},1,"Yang et al., 2015"]
["301a",{"$f":"IF(ISERROR(VLOOKUP(A50,AllExactCirculationAll!$A$2:$A$152, 1, FALSE)),\"No\",\"Yes\")","v":"Yes"},1,"Yang et al., 2015"]
[203,{"$f":"IF(ISERROR(VLOOKUP(A51,AllExactCirculationAll!$A$2:$A$152, 1, FALSE)),\"No\",\"Yes\")","v":"Yes"},1,"Yang et al., 2015"]
[205,{"$f":"IF(ISERROR(VLOOKUP(A52,AllExactCirculationAll!$A$2:$A$152, 1, FALSE)),\"No\",\"Yes\")","v":"Yes"},1,"Yang et al., 2015"]
["518a-3p",{"$f":"IF(ISERROR(VLOOKUP(A53,AllExactCirculationAll!$A$2:$A$152, 1, FALSE)),\"No\",\"Yes\")","v":"Yes"},1,"Yang et al., 2015"]
["519d",{"$f":"IF(ISERROR(VLOOKUP(A54,AllExactCirculationAll!$A$2:$A$152, 1, FALSE)),\"No\",\"Yes\")","v":"Yes"},1,"Yang et al., 2015"]
[93,{"$f":"IF(ISERROR(VLOOKUP(A55,AllExactCirculationAll!$A$2:$A$152, 1, FALSE)),\"No\",\"Yes\")","v":"Yes"},1,"Yang et al., 2015"]
["19b",{"$f":"IF(ISERROR(VLOOKUP(A56,AllExactCirculationAll!$A$2:$A$152, 1, FALSE)),\"No\",\"Yes\")","v":"Yes"},1,"Zhang et al., 2015"]
[424,{"$f":"IF(ISERROR(VLOOKUP(A57,AllExactCirculationAll!$A$2:$A$152, 1, FALSE)),\"No\",\"Yes\")","v":"Yes"},1,"Zhang et al., 2015"]
["517*",{"$f":"IF(ISERROR(VLOOKUP(A58,AllExactCirculationAll!$A$2:$A$152, 1, FALSE)),\"No\",\"Yes\")","v":"Yes"},1,"Zhu et al., 2009"]
[144,{"$f":"IF(ISERROR(VLOOKUP(A59,AllExactCirculationAll!$A$2:$A$152, 1, FALSE)),\"No\",\"Yes\")","v":"Yes"},1,"Zhu et al., 2009"]
[141,{"$f":"IF(ISERROR(VLOOKUP(A60,AllExactCirculationAll!$A$2:$A$152, 1, FALSE)),\"No\",\"Yes\")","v":"Yes"},2,"Guo et al., 2011, Hu et al., 2009"]
["526b",{"$f":"IF(ISERROR(VLOOKUP(A61,AllExactCirculationAll!$A$2:$A$152, 1, FALSE)),\"No\",\"Yes\")","v":"Yes"},2,"Ishibashi et al., 2012, Mayor-Lynn et al., 2011"]
[296,{"$f":"IF(ISERROR(VLOOKUP(A62,AllExactCirculationAll!$A$2:$A$152, 1, FALSE)),\"No\",\"Yes\")","v":"Yes"},2,"Xu et al., 2014, Zhu et al., 2009"]
["199b-5p",{"$f":"IF(ISERROR(VLOOKUP(A63,AllExactCirculationAll!$A$2:$A$152, 1, FALSE)),\"No\",\"Yes\")","v":"Yes"},1,"Betoni et al., 2013"]
["196b",{"$f":"IF(ISERROR(VLOOKUP(A64,AllExactCirculationAll!$A$2:$A$152, 1, FALSE)),\"No\",\"Yes\")","v":"Yes"},1,"Betoni et al., 2013"]
["296-3p",{"$f":"IF(ISERROR(VLOOKUP(A65,AllExactCirculationAll!$A$2:$A$152, 1, FALSE)),\"No\",\"Yes\")","v":"Yes"},1,"Choi et al., 2013"]
[525,{"$f":"IF(ISERROR(VLOOKUP(A66,AllExactCirculationAll!$A$2:$A$152, 1, FALSE)),\"No\",\"Yes\")","v":"Yes"},1,"Guo et al., 2011"]
[222,{"$f":"IF(ISERROR(VLOOKUP(A67,AllExactCirculationAll!$A$2:$A$152, 1, FALSE)),\"No\",\"Yes\")","v":"Yes"},1,"Hu et al., 2009"]
["525-5p",{"$f":"IF(ISERROR(VLOOKUP(A68,AllExactCirculationAll!$A$2:$A$152, 1, FALSE)),\"No\",\"Yes\")","v":"Yes"},1,"Ishibashi et al., 2012"]
["516a-5p",{"$f":"IF(ISERROR(VLOOKUP(A69,AllExactCirculationAll!$A$2:$A$152, 1, FALSE)),\"No\",\"Yes\")","v":"Yes"},1,"Wang, W. et al. 2012"]
[584,{"$f":"IF(ISERROR(VLOOKUP(A70,AllExactCirculationAll!$A$2:$A$152, 1, FALSE)),\"No\",\"Yes\")","v":"No"},5,"Enquobahrie et al., 2011, Jiang et al., 2015, Xu et al., 2014, Zhang et al., 2015, Zhu et al., 2009"]
[363,{"$f":"IF(ISERROR(VLOOKUP(A71,AllExactCirculationAll!$A$2:$A$152, 1, FALSE)),\"No\",\"Yes\")","v":"No"},4,"Betoni et al., 2013, Xu et al., 2014, Zhang et al., 2015, Zhu et al., 2009"]
[1,{"$f":"IF(ISERROR(VLOOKUP(A72,AllExactCirculationAll!$A$2:$A$152, 1, FALSE)),\"No\",\"Yes\")","v":"No"},3,"Enquobahrie et al., 2011, Zhang et al., 2015, Zhu et al., 2009"]
[195,{"$f":"IF(ISERROR(VLOOKUP(A73,AllExactCirculationAll!$A$2:$A$152, 1, FALSE)),\"No\",\"Yes\")","v":"No"},3,"Hu et al., 2009, Xu et al., 2014, Zhu et al., 2009"]
[493,{"$f":"IF(ISERROR(VLOOKUP(A74,AllExactCirculationAll!$A$2:$A$152, 1, FALSE)),\"No\",\"Yes\")","v":"No"},2,"Betoni et al., 2013, Mayor-Lynn et al., 2011"]
["34c-5p",{"$f":"IF(ISERROR(VLOOKUP(A75,AllExactCirculationAll!$A$2:$A$152, 1, FALSE)),\"No\",\"Yes\")","v":"No"},2,"Enquobahrie et al., 2011, Wang, W. et al. 2012"]
["517a",{"$f":"IF(ISERROR(VLOOKUP(A76,AllExactCirculationAll!$A$2:$A$152, 1, FALSE)),\"No\",\"Yes\")","v":"No"},2,"Guo et al., 2011, Mayor-Lynn et al., 2011"]
[22,{"$f":"IF(ISERROR(VLOOKUP(A77,AllExactCirculationAll!$A$2:$A$152, 1, FALSE)),\"No\",\"Yes\")","v":"No"},2,"Guo et al., 2011, Ishibashi et al., 2012"]
["20b",{"$f":"IF(ISERROR(VLOOKUP(A78,AllExactCirculationAll!$A$2:$A$152, 1, FALSE)),\"No\",\"Yes\")","v":"No"},2,"Hu et al., 2009, Wang, W. et al. 2012"]
[214,{"$f":"IF(ISERROR(VLOOKUP(A79,AllExactCirculationAll!$A$2:$A$152, 1, FALSE)),\"No\",\"Yes\")","v":"No"},2,"Hu et al., 2009, Xu et al., 2014"]
["193b",{"$f":"IF(ISERROR(VLOOKUP(A80,AllExactCirculationAll!$A$2:$A$152, 1, FALSE)),\"No\",\"Yes\")","v":"No"},2,"Ishibashi et al., 2012, Xu et al., 2014"]
["10b",{"$f":"IF(ISERROR(VLOOKUP(A81,AllExactCirculationAll!$A$2:$A$152, 1, FALSE)),\"No\",\"Yes\")","v":"No"},2,"Ishibashi et al., 2012, Zhu et al., 2009"]
["20a",{"$f":"IF(ISERROR(VLOOKUP(A82,AllExactCirculationAll!$A$2:$A$152, 1, FALSE)),\"No\",\"Yes\")","v":"No"},2,"Ishibashi et al., 2012, Zhang et al., 2015"]
["146b-5p",{"$f":"IF(ISERROR(VLOOKUP(A83,AllExactCirculationAll!$A$2:$A$152, 1, FALSE)),\"No\",\"Yes\")","v":"No"},2,"Ishibashi et al., 2012, Mayor-Lynn et al., 2011"]
[377,{"$f":"IF(ISERROR(VLOOKUP(A84,AllExactCirculationAll!$A$2:$A$152, 1, FALSE)),\"No\",\"Yes\")","v":"No"},2,"Jiang et al., 2015, Zhu et al., 2009"]
["146a",{"$f":"IF(ISERROR(VLOOKUP(A85,AllExactCirculationAll!$A$2:$A$152, 1, FALSE)),\"No\",\"Yes\")","v":"No"},2,"Mayor-Lynn et al., 2011, Wang, W. et al. 2012"]
["512-3p",{"$f":"IF(ISERROR(VLOOKUP(A86,AllExactCirculationAll!$A$2:$A$152, 1, FALSE)),\"No\",\"Yes\")","v":"No"},2,"Mayor-Lynn et al., 2011, Wang, W. et al. 2012"]
["30a-3p",{"$f":"IF(ISERROR(VLOOKUP(A87,AllExactCirculationAll!$A$2:$A$152, 1, FALSE)),\"No\",\"Yes\")","v":"No"},2,"Xu et al., 2014, Zhu et al., 2009"]
[638,{"$f":"IF(ISERROR(VLOOKUP(A88,AllExactCirculationAll!$A$2:$A$152, 1, FALSE)),\"No\",\"Yes\")","v":"No"},2,"Xu et al., 2014, Zhu et al., 2009"]
[362,{"$f":"IF(ISERROR(VLOOKUP(A89,AllExactCirculationAll!$A$2:$A$152, 1, FALSE)),\"No\",\"Yes\")","v":"No"},2,"Xu et al., 2014, Zhu et al., 2009"]
[218,{"$f":"IF(ISERROR(VLOOKUP(A90,AllExactCirculationAll!$A$2:$A$152, 1, FALSE)),\"No\",\"Yes\")","v":"No"},2,"Xu et al., 2014, Zhu et al., 2009"]
[590,{"$f":"IF(ISERROR(VLOOKUP(A91,AllExactCirculationAll!$A$2:$A$152, 1, FALSE)),\"No\",\"Yes\")","v":"No"},2,"Xu et al., 2014, Zhu et al., 2009"]
[411,{"$f":"IF(ISERROR(VLOOKUP(A92,AllExactCirculationAll!$A$2:$A$152, 1, FALSE)),\"No\",\"Yes\")","v":"No"},2,"Xu et al., 2014, Zhu et al., 2009"]
[7,{"$f":"IF(ISERROR(VLOOKUP(A93,AllExactCirculationAll!$A$2:$A$152, 1, FALSE)),\"No\",\"Yes\")","v":"No"},1,"Betoni et al., 2013"]
[585,{"$f":"IF(ISERROR(VLOOKUP(A94,AllExactCirculationAll!$A$2:$A$152, 1, FALSE)),\"No\",\"Yes\")","v":"No"},1,"Betoni et al., 2013"]
["520f",{"$f":"IF(ISERROR(VLOOKUP(A95,AllExactCirculationAll!$A$2:$A$152, 1, FALSE)),\"No\",\"Yes\")","v":"No"},1,"Betoni et al., 2013"]
["520c-3p",{"$f":"IF(ISERROR(VLOOKUP(A96,AllExactCirculationAll!$A$2:$A$152, 1, FALSE)),\"No\",\"Yes\")","v":"No"},1,"Betoni et al., 2013"]
[128,{"$f":"IF(ISERROR(VLOOKUP(A97,AllExactCirculationAll!$A$2:$A$152, 1, FALSE)),\"No\",\"Yes\")","v":"No"},1,"Betoni et al., 2013"]
["551b",{"$f":"IF(ISERROR(VLOOKUP(A98,AllExactCirculationAll!$A$2:$A$152, 1, FALSE)),\"No\",\"Yes\")","v":"No"},1,"Betoni et al., 2013"]
["140-5p",{"$f":"IF(ISERROR(VLOOKUP(A99,AllExactCirculationAll!$A$2:$A$152, 1, FALSE)),\"No\",\"Yes\")","v":"No"},1,"Betoni et al., 2013"]
["92b",{"$f":"IF(ISERROR(VLOOKUP(A100,AllExactCirculationAll!$A$2:$A$152, 1, FALSE)),\"No\",\"Yes\")","v":"No"},1,"Choi et al., 2013"]
[197,{"$f":"IF(ISERROR(VLOOKUP(A101,AllExactCirculationAll!$A$2:$A$152, 1, FALSE)),\"No\",\"Yes\")","v":"No"},1,"Choi et al., 2013"]
[198,{"$f":"IF(ISERROR(VLOOKUP(A102,AllExactCirculationAll!$A$2:$A$152, 1, FALSE)),\"No\",\"Yes\")","v":"No"},1,"Choi et al., 2013"]
[202,{"$f":"IF(ISERROR(VLOOKUP(A103,AllExactCirculationAll!$A$2:$A$152, 1, FALSE)),\"No\",\"Yes\")","v":"No"},1,"Choi et al., 2013"]
[191,{"$f":"IF(ISERROR(VLOOKUP(A104,AllExactCirculationAll!$A$2:$A$152, 1, FALSE)),\"No\",\"Yes\")","v":"No"},1,"Choi et al., 2013"]
[95,{"$f":"IF(ISERROR(VLOOKUP(A105,AllExactCirculationAll!$A$2:$A$152, 1, FALSE)),\"No\",\"Yes\")","v":"No"},1,"Choi et al., 2013"]
[328,{"$f":"IF(ISERROR(VLOOKUP(A106,AllExactCirculationAll!$A$2:$A$152, 1, FALSE)),\"No\",\"Yes\")","v":"No"},1,"Enquobahrie et al., 2011"]
["139-5p",{"$f":"IF(ISERROR(VLOOKUP(A107,AllExactCirculationAll!$A$2:$A$152, 1, FALSE)),\"No\",\"Yes\")","v":"No"},1,"Enquobahrie et al., 2011"]
[500,{"$f":"IF(ISERROR(VLOOKUP(A108,AllExactCirculationAll!$A$2:$A$152, 1, FALSE)),\"No\",\"Yes\")","v":"No"},1,"Enquobahrie et al., 2011"]
[1247,{"$f":"IF(ISERROR(VLOOKUP(A109,AllExactCirculationAll!$A$2:$A$152, 1, FALSE)),\"No\",\"Yes\")","v":"No"},1,"Enquobahrie et al., 2011"]
[143,{"$f":"IF(ISERROR(VLOOKUP(A110,AllExactCirculationAll!$A$2:$A$152, 1, FALSE)),\"No\",\"Yes\")","v":"No"},1,"Guo et al., 2011"]
[194,{"$f":"IF(ISERROR(VLOOKUP(A111,AllExactCirculationAll!$A$2:$A$152, 1, FALSE)),\"No\",\"Yes\")","v":"No"},1,"Guo et al., 2013"]
["7f",{"$f":"IF(ISERROR(VLOOKUP(A112,AllExactCirculationAll!$A$2:$A$152, 1, FALSE)),\"No\",\"Yes\")","v":"No"},1,"Hu et al., 2009"]
[565,{"$f":"IF(ISERROR(VLOOKUP(A113,AllExactCirculationAll!$A$2:$A$152, 1, FALSE)),\"No\",\"Yes\")","v":"No"},1,"Hu et al., 2009"]
["519b-3p",{"$f":"IF(ISERROR(VLOOKUP(A114,AllExactCirculationAll!$A$2:$A$152, 1, FALSE)),\"No\",\"Yes\")","v":"No"},1,"Hu et al., 2009"]
["450a",{"$f":"IF(ISERROR(VLOOKUP(A115,AllExactCirculationAll!$A$2:$A$152, 1, FALSE)),\"No\",\"Yes\")","v":"No"},1,"Hu et al., 2009"]
["30e",{"$f":"IF(ISERROR(VLOOKUP(A116,AllExactCirculationAll!$A$2:$A$152, 1, FALSE)),\"No\",\"Yes\")","v":"No"},1,"Hu et al., 2009"]
[522,{"$f":"IF(ISERROR(VLOOKUP(A117,AllExactCirculationAll!$A$2:$A$152, 1, FALSE)),\"No\",\"Yes\")","v":"No"},1,"Hu et al., 2009"]
["486-3p",{"$f":"IF(ISERROR(VLOOKUP(A118,AllExactCirculationAll!$A$2:$A$152, 1, FALSE)),\"No\",\"Yes\")","v":"No"},1,"Hu et al., 2009"]
[658,{"$f":"IF(ISERROR(VLOOKUP(A119,AllExactCirculationAll!$A$2:$A$152, 1, FALSE)),\"No\",\"Yes\")","v":"No"},1,"Hu et al., 2009"]
["523-3p",{"$f":"IF(ISERROR(VLOOKUP(A120,AllExactCirculationAll!$A$2:$A$152, 1, FALSE)),\"No\",\"Yes\")","v":"No"},1,"Hu et al., 2009"]
["423-5p",{"$f":"IF(ISERROR(VLOOKUP(A121,AllExactCirculationAll!$A$2:$A$152, 1, FALSE)),\"No\",\"Yes\")","v":"No"},1,"Hu et al., 2009"]
["491-5p",{"$f":"IF(ISERROR(VLOOKUP(A122,AllExactCirculationAll!$A$2:$A$152, 1, FALSE)),\"No\",\"Yes\")","v":"No"},1,"Hu et al., 2009"]
[612,{"$f":"IF(ISERROR(VLOOKUP(A123,AllExactCirculationAll!$A$2:$A$152, 1, FALSE)),\"No\",\"Yes\")","v":"No"},1,"Hu et al., 2009"]
["508-5p",{"$f":"IF(ISERROR(VLOOKUP(A124,AllExactCirculationAll!$A$2:$A$152, 1, FALSE)),\"No\",\"Yes\")","v":"No"},1,"Hu et al., 2009"]
["193b*",{"$f":"IF(ISERROR(VLOOKUP(A125,AllExactCirculationAll!$A$2:$A$152, 1, FALSE)),\"No\",\"Yes\")","v":"No"},1,"Ishibashi et al., 2012"]
["590-5p",{"$f":"IF(ISERROR(VLOOKUP(A126,AllExactCirculationAll!$A$2:$A$152, 1, FALSE)),\"No\",\"Yes\")","v":"No"},1,"Ishibashi et al., 2012"]
["520a-3p",{"$f":"IF(ISERROR(VLOOKUP(A127,AllExactCirculationAll!$A$2:$A$152, 1, FALSE)),\"No\",\"Yes\")","v":"No"},1,"Ishibashi et al., 2012"]
["518f",{"$f":"IF(ISERROR(VLOOKUP(A128,AllExactCirculationAll!$A$2:$A$152, 1, FALSE)),\"No\",\"Yes\")","v":"No"},1,"Ishibashi et al., 2012"]
["451a",{"$f":"IF(ISERROR(VLOOKUP(A129,AllExactCirculationAll!$A$2:$A$152, 1, FALSE)),\"No\",\"Yes\")","v":"No"},1,"Jiang et al., 2015"]
[17,{"$f":"IF(ISERROR(VLOOKUP(A130,AllExactCirculationAll!$A$2:$A$152, 1, FALSE)),\"No\",\"Yes\")","v":"No"},1,"Jiang et al., 2015"]
[516,{"$f":"IF(ISERROR(VLOOKUP(A131,AllExactCirculationAll!$A$2:$A$152, 1, FALSE)),\"No\",\"Yes\")","v":"No"},1,"Jiang et al., 2015"]
["135a",{"$f":"IF(ISERROR(VLOOKUP(A132,AllExactCirculationAll!$A$2:$A$152, 1, FALSE)),\"No\",\"Yes\")","v":"No"},1,"Jiang et al., 2015"]
[96,{"$f":"IF(ISERROR(VLOOKUP(A133,AllExactCirculationAll!$A$2:$A$152, 1, FALSE)),\"No\",\"Yes\")","v":"No"},1,"Jiang et al., 2015"]
[196,{"$f":"IF(ISERROR(VLOOKUP(A134,AllExactCirculationAll!$A$2:$A$152, 1, FALSE)),\"No\",\"Yes\")","v":"No"},1,"Jiang et al., 2015"]
["362-3p",{"$f":"IF(ISERROR(VLOOKUP(A135,AllExactCirculationAll!$A$2:$A$152, 1, FALSE)),\"No\",\"Yes\")","v":"No"},1,"Jiang et al., 2015"]
[496,{"$f":"IF(ISERROR(VLOOKUP(A136,AllExactCirculationAll!$A$2:$A$152, 1, FALSE)),\"No\",\"Yes\")","v":"No"},1,"Mayor-Lynn et al., 2011"]
[431,{"$f":"IF(ISERROR(VLOOKUP(A137,AllExactCirculationAll!$A$2:$A$152, 1, FALSE)),\"No\",\"Yes\")","v":"No"},1,"Mayor-Lynn et al., 2011"]
[720,{"$f":"IF(ISERROR(VLOOKUP(A138,AllExactCirculationAll!$A$2:$A$152, 1, FALSE)),\"No\",\"Yes\")","v":"No"},1,"Mayor-Lynn et al., 2011"]
["654-3p",{"$f":"IF(ISERROR(VLOOKUP(A139,AllExactCirculationAll!$A$2:$A$152, 1, FALSE)),\"No\",\"Yes\")","v":"No"},1,"Mayor-Lynn et al., 2011"]
["181d",{"$f":"IF(ISERROR(VLOOKUP(A140,AllExactCirculationAll!$A$2:$A$152, 1, FALSE)),\"No\",\"Yes\")","v":"No"},1,"Mayor-Lynn et al., 2011"]
["145*",{"$f":"IF(ISERROR(VLOOKUP(A141,AllExactCirculationAll!$A$2:$A$152, 1, FALSE)),\"No\",\"Yes\")","v":"No"},1,"Mayor-Lynn et al., 2011"]
[539,{"$f":"IF(ISERROR(VLOOKUP(A142,AllExactCirculationAll!$A$2:$A$152, 1, FALSE)),\"No\",\"Yes\")","v":"No"},1,"Mayor-Lynn et al., 2011"]
["let-7e",{"$f":"IF(ISERROR(VLOOKUP(A143,AllExactCirculationAll!$A$2:$A$152, 1, FALSE)),\"No\",\"Yes\")","v":"No"},1,"Mayor-Lynn et al., 2011"]
[495,{"$f":"IF(ISERROR(VLOOKUP(A144,AllExactCirculationAll!$A$2:$A$152, 1, FALSE)),\"No\",\"Yes\")","v":"No"},1,"Mayor-Lynn et al., 2011"]
["let-7b",{"$f":"IF(ISERROR(VLOOKUP(A145,AllExactCirculationAll!$A$2:$A$152, 1, FALSE)),\"No\",\"Yes\")","v":"No"},1,"Noack et al., 2011"]
["302*",{"$f":"IF(ISERROR(VLOOKUP(A146,AllExactCirculationAll!$A$2:$A$152, 1, FALSE)),\"No\",\"Yes\")","v":"No"},1,"Noack et al., 2011"]
[104,{"$f":"IF(ISERROR(VLOOKUP(A147,AllExactCirculationAll!$A$2:$A$152, 1, FALSE)),\"No\",\"Yes\")","v":"No"},1,"Noack et al., 2011"]
["128a",{"$f":"IF(ISERROR(VLOOKUP(A148,AllExactCirculationAll!$A$2:$A$152, 1, FALSE)),\"No\",\"Yes\")","v":"No"},1,"Noack et al., 2011"]
["182*",{"$f":"IF(ISERROR(VLOOKUP(A149,AllExactCirculationAll!$A$2:$A$152, 1, FALSE)),\"No\",\"Yes\")","v":"No"},1,"Noack et al., 2011"]
["133b",{"$f":"IF(ISERROR(VLOOKUP(A150,AllExactCirculationAll!$A$2:$A$152, 1, FALSE)),\"No\",\"Yes\")","v":"No"},1,"Noack et al., 2011"]
[2277,{"$f":"IF(ISERROR(VLOOKUP(A151,AllExactCirculationAll!$A$2:$A$152, 1, FALSE)),\"No\",\"Yes\")","v":"No"},1,"Wang, W. et al. 2012"]
["524-3p",{"$f":"IF(ISERROR(VLOOKUP(A152,AllExactCirculationAll!$A$2:$A$152, 1, FALSE)),\"No\",\"Yes\")","v":"No"},1,"Wang, W. et al. 2012"]
[192,{"$f":"IF(ISERROR(VLOOKUP(A153,AllExactCirculationAll!$A$2:$A$152, 1, FALSE)),\"No\",\"Yes\")","v":"No"},1,"Wang, W. et al. 2012"]
[1301,{"$f":"IF(ISERROR(VLOOKUP(A154,AllExactCirculationAll!$A$2:$A$152, 1, FALSE)),\"No\",\"Yes\")","v":"No"},1,"Weedon-Fekjær al., 2014"]
["223-3p",{"$f":"IF(ISERROR(VLOOKUP(A155,AllExactCirculationAll!$A$2:$A$152, 1, FALSE)),\"No\",\"Yes\")","v":"No"},1,"Weedon-Fekjær al., 2014"]
["224-5p",{"$f":"IF(ISERROR(VLOOKUP(A156,AllExactCirculationAll!$A$2:$A$152, 1, FALSE)),\"No\",\"Yes\")","v":"No"},1,"Weedon-Fekjær al., 2014"]
[151,{"$f":"IF(ISERROR(VLOOKUP(A157,AllExactCirculationAll!$A$2:$A$152, 1, FALSE)),\"No\",\"Yes\")","v":"No"},1,"Xu et al., 2014"]
[31,{"$f":"IF(ISERROR(VLOOKUP(A158,AllExactCirculationAll!$A$2:$A$152, 1, FALSE)),\"No\",\"Yes\")","v":"No"},1,"Xu et al., 2014"]
["17-3p",{"$f":"IF(ISERROR(VLOOKUP(A159,AllExactCirculationAll!$A$2:$A$152, 1, FALSE)),\"No\",\"Yes\")","v":"No"},1,"Xu et al., 2014"]
[524,{"$f":"IF(ISERROR(VLOOKUP(A160,AllExactCirculationAll!$A$2:$A$152, 1, FALSE)),\"No\",\"Yes\")","v":"No"},1,"Xu et al., 2014"]
[379,{"$f":"IF(ISERROR(VLOOKUP(A161,AllExactCirculationAll!$A$2:$A$152, 1, FALSE)),\"No\",\"Yes\")","v":"No"},1,"Xu et al., 2014"]
["125b-1-3p",{"$f":"IF(ISERROR(VLOOKUP(A162,AllExactCirculationAll!$A$2:$A$152, 1, FALSE)),\"No\",\"Yes\")","v":"No"},1,"Zhang et al., 2015"]
[355,{"$f":"IF(ISERROR(VLOOKUP(A163,AllExactCirculationAll!$A$2:$A$152, 1, FALSE)),\"No\",\"Yes\")","v":"No"},1,"Zhang et al., 2015"]
[1469,{"$f":"IF(ISERROR(VLOOKUP(A164,AllExactCirculationAll!$A$2:$A$152, 1, FALSE)),\"No\",\"Yes\")","v":"No"},1,"Zhang et al., 2015"]
["29a-3p",{"$f":"IF(ISERROR(VLOOKUP(A165,AllExactCirculationAll!$A$2:$A$152, 1, FALSE)),\"No\",\"Yes\")","v":"No"},1,"Zhang et al., 2015"]
["200c",{"$f":"IF(ISERROR(VLOOKUP(A166,AllExactCirculationAll!$A$2:$A$152, 1, FALSE)),\"No\",\"Yes\")","v":"No"},1,"Zhang et al., 2015"]
[744,{"$f":"IF(ISERROR(VLOOKUP(A167,AllExactCirculationAll!$A$2:$A$152, 1, FALSE)),\"No\",\"Yes\")","v":"No"},1,"Zhang et al., 2015"]
[1826,{"$f":"IF(ISERROR(VLOOKUP(A168,AllExactCirculationAll!$A$2:$A$152, 1, FALSE)),\"No\",\"Yes\")","v":"No"},1,"Zhang et al., 2015"]
["154*",{"$f":"IF(ISERROR(VLOOKUP(A169,AllExactCirculationAll!$A$2:$A$152, 1, FALSE)),\"No\",\"Yes\")","v":"No"},1,"Zhu et al., 2009"]
[625,{"$f":"IF(ISERROR(VLOOKUP(A170,AllExactCirculationAll!$A$2:$A$152, 1, FALSE)),\"No\",\"Yes\")","v":"No"},1,"Zhu et al., 2009"]
[150,{"$f":"IF(ISERROR(VLOOKUP(A171,AllExactCirculationAll!$A$2:$A$152, 1, FALSE)),\"No\",\"Yes\")","v":"No"},1,"Zhu et al., 2009"]
[450,{"$f":"IF(ISERROR(VLOOKUP(A172,AllExactCirculationAll!$A$2:$A$152, 1, FALSE)),\"No\",\"Yes\")","v":"No"},1,"Zhu et al., 2009"]
[374,{"$f":"IF(ISERROR(VLOOKUP(A173,AllExactCirculationAll!$A$2:$A$152, 1, FALSE)),\"No\",\"Yes\")","v":"No"},1,"Zhu et al., 2009"]

{"sheet":"ScreenExactCirculationAll","index":4,"n_rows":105,"n_cols":4,"rows_kept":105}
["microRNA","In Placenta?","Cited","Studies"]
["519d",{"$f":"IF(ISERROR(VLOOKUP(A2,AllExactPlacentaAll!$A$2:$A$221, 1, FALSE)),\"No\",\"Yes\")","v":"Yes"},3,"Li et al., 2013, Yang et al., 2011, Yang et al., 2015"]
["517c",{"$f":"IF(ISERROR(VLOOKUP(A3,AllExactPlacentaAll!$A$2:$A$221, 1, FALSE)),\"No\",\"Yes\")","v":"Yes"},3,"Li et al., 2013, Yang et al., 2011, Yang et al., 2015"]
["29a",{"$f":"IF(ISERROR(VLOOKUP(A4,AllExactPlacentaAll!$A$2:$A$221, 1, FALSE)),\"No\",\"Yes\")","v":"Yes"},3,"Li et al., 2013, Yang et al., 2011, Yang et al., 2015"]
[144,{"$f":"IF(ISERROR(VLOOKUP(A5,AllExactPlacentaAll!$A$2:$A$221, 1, FALSE)),\"No\",\"Yes\")","v":"Yes"},3,"Li et al., 2013, Ura et al., 2014, Wu et al., 2012"]
["130a",{"$f":"IF(ISERROR(VLOOKUP(A6,AllExactPlacentaAll!$A$2:$A$221, 1, FALSE)),\"No\",\"Yes\")","v":"Yes"},3,"Li et al., 2013, Wu et al., 2012, Yang et al., 2015"]
["18a",{"$f":"IF(ISERROR(VLOOKUP(A7,AllExactPlacentaAll!$A$2:$A$221, 1, FALSE)),\"No\",\"Yes\")","v":"Yes"},2,"Li et al., 2013, Yang et al., 2015"]
["125b",{"$f":"IF(ISERROR(VLOOKUP(A8,AllExactPlacentaAll!$A$2:$A$221, 1, FALSE)),\"No\",\"Yes\")","v":"Yes"},2,"Li et al., 2013, Yang et al., 2011"]
["27a",{"$f":"IF(ISERROR(VLOOKUP(A9,AllExactPlacentaAll!$A$2:$A$221, 1, FALSE)),\"No\",\"Yes\")","v":"Yes"},2,"Li et al., 2013, Yang et al., 2015"]
[24,{"$f":"IF(ISERROR(VLOOKUP(A10,AllExactPlacentaAll!$A$2:$A$221, 1, FALSE)),\"No\",\"Yes\")","v":"Yes"},2,"Li et al., 2013, Wu et al., 2012"]
["518b",{"$f":"IF(ISERROR(VLOOKUP(A11,AllExactPlacentaAll!$A$2:$A$221, 1, FALSE)),\"No\",\"Yes\")","v":"Yes"},2,"Li et al., 2013, Ura et al., 2014"]
[25,{"$f":"IF(ISERROR(VLOOKUP(A12,AllExactPlacentaAll!$A$2:$A$221, 1, FALSE)),\"No\",\"Yes\")","v":"Yes"},2,"Li et al., 2013, Ura et al., 2014"]
[223,{"$f":"IF(ISERROR(VLOOKUP(A13,AllExactPlacentaAll!$A$2:$A$221, 1, FALSE)),\"No\",\"Yes\")","v":"Yes"},2,"Li et al., 2013, Yang et al., 2011"]
[185,{"$f":"IF(ISERROR(VLOOKUP(A14,AllExactPlacentaAll!$A$2:$A$221, 1, FALSE)),\"No\",\"Yes\")","v":"Yes"},2,"Li et al., 2013, Yang et al., 2011"]
[126,{"$f":"IF(ISERROR(VLOOKUP(A15,AllExactPlacentaAll!$A$2:$A$221, 1, FALSE)),\"No\",\"Yes\")","v":"Yes"},2,"Ura et al., 2014, Yang et al., 2015"]
["518e",{"$f":"IF(ISERROR(VLOOKUP(A16,AllExactPlacentaAll!$A$2:$A$221, 1, FALSE)),\"No\",\"Yes\")","v":"Yes"},2,"Yang et al., 2011, Yang et al., 2015"]
["19a",{"$f":"IF(ISERROR(VLOOKUP(A17,AllExactPlacentaAll!$A$2:$A$221, 1, FALSE)),\"No\",\"Yes\")","v":"Yes"},1,"Li et al., 2013"]
[101,{"$f":"IF(ISERROR(VLOOKUP(A18,AllExactPlacentaAll!$A$2:$A$221, 1, FALSE)),\"No\",\"Yes\")","v":"Yes"},1,"Li et al., 2013"]
["26b",{"$f":"IF(ISERROR(VLOOKUP(A19,AllExactPlacentaAll!$A$2:$A$221, 1, FALSE)),\"No\",\"Yes\")","v":"Yes"},1,"Li et al., 2013"]
[378,{"$f":"IF(ISERROR(VLOOKUP(A20,AllExactPlacentaAll!$A$2:$A$221, 1, FALSE)),\"No\",\"Yes\")","v":"Yes"},1,"Li et al., 2013"]
["144*",{"$f":"IF(ISERROR(VLOOKUP(A21,AllExactPlacentaAll!$A$2:$A$221, 1, FALSE)),\"No\",\"Yes\")","v":"Yes"},1,"Li et al., 2013"]
[182,{"$f":"IF(ISERROR(VLOOKUP(A22,AllExactPlacentaAll!$A$2:$A$221, 1, FALSE)),\"No\",\"Yes\")","v":"Yes"},1,"Li et al., 2013"]
["29c",{"$f":"IF(ISERROR(VLOOKUP(A23,AllExactPlacentaAll!$A$2:$A$221, 1, FALSE)),\"No\",\"Yes\")","v":"Yes"},1,"Li et al., 2013"]
["518c",{"$f":"IF(ISERROR(VLOOKUP(A24,AllExactPlacentaAll!$A$2:$A$221, 1, FALSE)),\"No\",\"Yes\")","v":"Yes"},1,"Li et al., 2013"]
["515-3p",{"$f":"IF(ISERROR(VLOOKUP(A25,AllExactPlacentaAll!$A$2:$A$221, 1, FALSE)),\"No\",\"Yes\")","v":"Yes"},1,"Li et al., 2013"]
[424,{"$f":"IF(ISERROR(VLOOKUP(A26,AllExactPlacentaAll!$A$2:$A$221, 1, FALSE)),\"No\",\"Yes\")","v":"Yes"},1,"Li et al., 2013"]
["29b",{"$f":"IF(ISERROR(VLOOKUP(A27,AllExactPlacentaAll!$A$2:$A$221, 1, FALSE)),\"No\",\"Yes\")","v":"Yes"},1,"Li et al., 2013"]
[21,{"$f":"IF(ISERROR(VLOOKUP(A28,AllExactPlacentaAll!$A$2:$A$221, 1, FALSE)),\"No\",\"Yes\")","v":"Yes"},1,"Li et al., 2013"]
["19b",{"$f":"IF(ISERROR(VLOOKUP(A29,AllExactPlacentaAll!$A$2:$A$221, 1, FALSE)),\"No\",\"Yes\")","v":"Yes"},1,"Li et al., 2013"]
[451,{"$f":"IF(ISERROR(VLOOKUP(A30,AllExactPlacentaAll!$A$2:$A$221, 1, FALSE)),\"No\",\"Yes\")","v":"Yes"},1,"Li et al., 2013"]
[210,{"$f":"IF(ISERROR(VLOOKUP(A31,AllExactPlacentaAll!$A$2:$A$221, 1, FALSE)),\"No\",\"Yes\")","v":"Yes"},1,"Ura et al., 2014"]
[32,{"$f":"IF(ISERROR(VLOOKUP(A32,AllExactPlacentaAll!$A$2:$A$221, 1, FALSE)),\"No\",\"Yes\")","v":"Yes"},1,"Ura et al., 2014"]
[204,{"$f":"IF(ISERROR(VLOOKUP(A33,AllExactPlacentaAll!$A$2:$A$221, 1, FALSE)),\"No\",\"Yes\")","v":"Yes"},1,"Ura et al., 2014"]
["296-5p",{"$f":"IF(ISERROR(VLOOKUP(A34,AllExactPlacentaAll!$A$2:$A$221, 1, FALSE)),\"No\",\"Yes\")","v":"Yes"},1,"Ura et al., 2014"]
[152,{"$f":"IF(ISERROR(VLOOKUP(A35,AllExactPlacentaAll!$A$2:$A$221, 1, FALSE)),\"No\",\"Yes\")","v":"Yes"},1,"Ura et al., 2014"]
[335,{"$f":"IF(ISERROR(VLOOKUP(A36,AllExactPlacentaAll!$A$2:$A$221, 1, FALSE)),\"No\",\"Yes\")","v":"Yes"},1,"Ura et al., 2014"]
["26a",{"$f":"IF(ISERROR(VLOOKUP(A37,AllExactPlacentaAll!$A$2:$A$221, 1, FALSE)),\"No\",\"Yes\")","v":"Yes"},1,"Wu et al., 2012"]
["151-3p",{"$f":"IF(ISERROR(VLOOKUP(A38,AllExactPlacentaAll!$A$2:$A$221, 1, FALSE)),\"No\",\"Yes\")","v":"Yes"},1,"Wu et al., 2012"]
["181a",{"$f":"IF(ISERROR(VLOOKUP(A39,AllExactPlacentaAll!$A$2:$A$221, 1, FALSE)),\"No\",\"Yes\")","v":"Yes"},1,"Wu et al., 2012"]
["30d",{"$f":"IF(ISERROR(VLOOKUP(A40,AllExactPlacentaAll!$A$2:$A$221, 1, FALSE)),\"No\",\"Yes\")","v":"Yes"},1,"Wu et al., 2012"]
["342-3p",{"$f":"IF(ISERROR(VLOOKUP(A41,AllExactPlacentaAll!$A$2:$A$221, 1, FALSE)),\"No\",\"Yes\")","v":"Yes"},1,"Wu et al., 2012"]
[16,{"$f":"IF(ISERROR(VLOOKUP(A42,AllExactPlacentaAll!$A$2:$A$221, 1, FALSE)),\"No\",\"Yes\")","v":"Yes"},1,"Wu et al., 2012"]
["520g",{"$f":"IF(ISERROR(VLOOKUP(A43,AllExactPlacentaAll!$A$2:$A$221, 1, FALSE)),\"No\",\"Yes\")","v":"Yes"},1,"Yang et al., 2011"]
["542-3p",{"$f":"IF(ISERROR(VLOOKUP(A44,AllExactPlacentaAll!$A$2:$A$221, 1, FALSE)),\"No\",\"Yes\")","v":"Yes"},1,"Yang et al., 2011"]
["135b",{"$f":"IF(ISERROR(VLOOKUP(A45,AllExactPlacentaAll!$A$2:$A$221, 1, FALSE)),\"No\",\"Yes\")","v":"Yes"},1,"Yang et al., 2015"]
[149,{"$f":"IF(ISERROR(VLOOKUP(A46,AllExactPlacentaAll!$A$2:$A$221, 1, FALSE)),\"No\",\"Yes\")","v":"Yes"},1,"Yang et al., 2015"]
["188-5p",{"$f":"IF(ISERROR(VLOOKUP(A47,AllExactPlacentaAll!$A$2:$A$221, 1, FALSE)),\"No\",\"Yes\")","v":"Yes"},1,"Yang et al., 2015"]
["18b",{"$f":"IF(ISERROR(VLOOKUP(A48,AllExactPlacentaAll!$A$2:$A$221, 1, FALSE)),\"No\",\"Yes\")","v":"Yes"},1,"Yang et al., 2015"]
[203,{"$f":"IF(ISERROR(VLOOKUP(A49,AllExactPlacentaAll!$A$2:$A$221, 1, FALSE)),\"No\",\"Yes\")","v":"Yes"},1,"Yang et al., 2015"]
[205,{"$f":"IF(ISERROR(VLOOKUP(A50,AllExactPlacentaAll!$A$2:$A$221, 1, FALSE)),\"No\",\"Yes\")","v":"Yes"},1,"Yang et al., 2015"]
[224,{"$f":"IF(ISERROR(VLOOKUP(A51,AllExactPlacentaAll!$A$2:$A$221, 1, FALSE)),\"No\",\"Yes\")","v":"Yes"},1,"Yang et al., 2015"]
["301a",{"$f":"IF(ISERROR(VLOOKUP(A52,AllExactPlacentaAll!$A$2:$A$221, 1, FALSE)),\"No\",\"Yes\")","v":"Yes"},1,"Yang et al., 2015"]
["518a-3p",{"$f":"IF(ISERROR(VLOOKUP(A53,AllExactPlacentaAll!$A$2:$A$221, 1, FALSE)),\"No\",\"Yes\")","v":"Yes"},1,"Yang et al., 2015"]
["126*",{"$f":"IF(ISERROR(VLOOKUP(A54,AllExactPlacentaAll!$A$2:$A$221, 1, FALSE)),\"No\",\"Yes\")","v":"Yes"},1,"Yang et al., 2015"]
["142-3p",{"$f":"IF(ISERROR(VLOOKUP(A55,AllExactPlacentaAll!$A$2:$A$221, 1, FALSE)),\"No\",\"Yes\")","v":"Yes"},1,"Yang et al., 2015"]
[93,{"$f":"IF(ISERROR(VLOOKUP(A56,AllExactPlacentaAll!$A$2:$A$221, 1, FALSE)),\"No\",\"Yes\")","v":"Yes"},1,"Yang et al., 2015"]
["34a",{"$f":"IF(ISERROR(VLOOKUP(A57,AllExactPlacentaAll!$A$2:$A$221, 1, FALSE)),\"No\",\"Yes\")","v":"Yes"},1,"Li et al., 2013"]
["517b",{"$f":"IF(ISERROR(VLOOKUP(A58,AllExactPlacentaAll!$A$2:$A$221, 1, FALSE)),\"No\",\"Yes\")","v":"No"},2,"Li et al., 2013, Yang et al., 2011"]
[221,{"$f":"IF(ISERROR(VLOOKUP(A59,AllExactPlacentaAll!$A$2:$A$221, 1, FALSE)),\"No\",\"Yes\")","v":"No"},2,"Li et al., 2013, Wu et al., 2012"]
[521,{"$f":"IF(ISERROR(VLOOKUP(A60,AllExactPlacentaAll!$A$2:$A$221, 1, FALSE)),\"No\",\"Yes\")","v":"No"},2,"Li et al., 2013, Yang et al., 2011"]
["519a",{"$f":"IF(ISERROR(VLOOKUP(A61,AllExactPlacentaAll!$A$2:$A$221, 1, FALSE)),\"No\",\"Yes\")","v":"No"},2,"Li et al., 2013, Yang et al., 2011"]
["520h",{"$f":"IF(ISERROR(VLOOKUP(A62,AllExactPlacentaAll!$A$2:$A$221, 1, FALSE)),\"No\",\"Yes\")","v":"No"},2,"Li et al., 2013, Yang et al., 2011"]
["125a-5p",{"$f":"IF(ISERROR(VLOOKUP(A63,AllExactPlacentaAll!$A$2:$A$221, 1, FALSE)),\"No\",\"Yes\")","v":"No"},2,"Li et al., 2013, Yang et al., 2011"]
[145,{"$f":"IF(ISERROR(VLOOKUP(A64,AllExactPlacentaAll!$A$2:$A$221, 1, FALSE)),\"No\",\"Yes\")","v":"No"},2,"Li et al., 2013, Wu et al., 2012"]
["15b",{"$f":"IF(ISERROR(VLOOKUP(A65,AllExactPlacentaAll!$A$2:$A$221, 1, FALSE)),\"No\",\"Yes\")","v":"No"},2,"Li et al., 2013, Ura et al., 2014"]
["320c",{"$f":"IF(ISERROR(VLOOKUP(A66,AllExactPlacentaAll!$A$2:$A$221, 1, FALSE)),\"No\",\"Yes\")","v":"No"},2,"Li et al., 2013, Yang et al., 2011"]
["let-7f",{"$f":"IF(ISERROR(VLOOKUP(A67,AllExactPlacentaAll!$A$2:$A$221, 1, FALSE)),\"No\",\"Yes\")","v":"No"},2,"Li et al., 2013, Yang et al., 2011"]
["23a*",{"$f":"IF(ISERROR(VLOOKUP(A68,AllExactPlacentaAll!$A$2:$A$221, 1, FALSE)),\"No\",\"Yes\")","v":"No"},1,"Akehurst et al., 2015"]
["196b-5p",{"$f":"IF(ISERROR(VLOOKUP(A69,AllExactPlacentaAll!$A$2:$A$221, 1, FALSE)),\"No\",\"Yes\")","v":"No"},1,"Akehurst et al., 2015"]
["206-5p",{"$f":"IF(ISERROR(VLOOKUP(A70,AllExactPlacentaAll!$A$2:$A$221, 1, FALSE)),\"No\",\"Yes\")","v":"No"},1,"Akehurst et al., 2015"]
["502-5p",{"$f":"IF(ISERROR(VLOOKUP(A71,AllExactPlacentaAll!$A$2:$A$221, 1, FALSE)),\"No\",\"Yes\")","v":"No"},1,"Akehurst et al., 2015"]
["503-5p",{"$f":"IF(ISERROR(VLOOKUP(A72,AllExactPlacentaAll!$A$2:$A$221, 1, FALSE)),\"No\",\"Yes\")","v":"No"},1,"Akehurst et al., 2015"]
["758-3p",{"$f":"IF(ISERROR(VLOOKUP(A73,AllExactPlacentaAll!$A$2:$A$221, 1, FALSE)),\"No\",\"Yes\")","v":"No"},1,"Akehurst et al., 2015"]
["10a",{"$f":"IF(ISERROR(VLOOKUP(A74,AllExactPlacentaAll!$A$2:$A$221, 1, FALSE)),\"No\",\"Yes\")","v":"No"},1,"Li et al., 2013"]
[114,{"$f":"IF(ISERROR(VLOOKUP(A75,AllExactPlacentaAll!$A$2:$A$221, 1, FALSE)),\"No\",\"Yes\")","v":"No"},1,"Li et al., 2013"]
["15b*",{"$f":"IF(ISERROR(VLOOKUP(A76,AllExactPlacentaAll!$A$2:$A$221, 1, FALSE)),\"No\",\"Yes\")","v":"No"},1,"Li et al., 2013"]
["30a",{"$f":"IF(ISERROR(VLOOKUP(A77,AllExactPlacentaAll!$A$2:$A$221, 1, FALSE)),\"No\",\"Yes\")","v":"No"},1,"Li et al., 2013"]
["519e",{"$f":"IF(ISERROR(VLOOKUP(A78,AllExactPlacentaAll!$A$2:$A$221, 1, FALSE)),\"No\",\"Yes\")","v":"No"},1,"Li et al., 2013"]
["299a-5p",{"$f":"IF(ISERROR(VLOOKUP(A79,AllExactPlacentaAll!$A$2:$A$221, 1, FALSE)),\"No\",\"Yes\")","v":"No"},1,"Li et al., 2013"]
["23a",{"$f":"IF(ISERROR(VLOOKUP(A80,AllExactPlacentaAll!$A$2:$A$221, 1, FALSE)),\"No\",\"Yes\")","v":"No"},1,"Li et al., 2013"]
["23b",{"$f":"IF(ISERROR(VLOOKUP(A81,AllExactPlacentaAll!$A$2:$A$221, 1, FALSE)),\"No\",\"Yes\")","v":"No"},1,"Li et al., 2013"]
["525-3p",{"$f":"IF(ISERROR(VLOOKUP(A82,AllExactPlacentaAll!$A$2:$A$221, 1, FALSE)),\"No\",\"Yes\")","v":"No"},1,"Li et al., 2013"]
["199a-5p",{"$f":"IF(ISERROR(VLOOKUP(A83,AllExactPlacentaAll!$A$2:$A$221, 1, FALSE)),\"No\",\"Yes\")","v":"No"},1,"Li et al., 2013"]
[100,{"$f":"IF(ISERROR(VLOOKUP(A84,AllExactPlacentaAll!$A$2:$A$221, 1, FALSE)),\"No\",\"Yes\")","v":"No"},1,"Li et al., 2013"]
["99a",{"$f":"IF(ISERROR(VLOOKUP(A85,AllExactPlacentaAll!$A$2:$A$221, 1, FALSE)),\"No\",\"Yes\")","v":"No"},1,"Li et al., 2013"]
["512-5p",{"$f":"IF(ISERROR(VLOOKUP(A86,AllExactPlacentaAll!$A$2:$A$221, 1, FALSE)),\"No\",\"Yes\")","v":"No"},1,"Li et al., 2013"]
["30b",{"$f":"IF(ISERROR(VLOOKUP(A87,AllExactPlacentaAll!$A$2:$A$221, 1, FALSE)),\"No\",\"Yes\")","v":"No"},1,"Li et al., 2013"]
[107,{"$f":"IF(ISERROR(VLOOKUP(A88,AllExactPlacentaAll!$A$2:$A$221, 1, FALSE)),\"No\",\"Yes\")","v":"No"},1,"Li et al., 2013"]
[1233,{"$f":"IF(ISERROR(VLOOKUP(A89,AllExactPlacentaAll!$A$2:$A$221, 1, FALSE)),\"No\",\"Yes\")","v":"No"},1,"Ura et al., 2014"]
[650,{"$f":"IF(ISERROR(VLOOKUP(A90,AllExactPlacentaAll!$A$2:$A$221, 1, FALSE)),\"No\",\"Yes\")","v":"No"},1,"Ura et al., 2014"]
["520a",{"$f":"IF(ISERROR(VLOOKUP(A91,AllExactPlacentaAll!$A$2:$A$221, 1, FALSE)),\"No\",\"Yes\")","v":"No"},1,"Ura et al., 2014"]
[215,{"$f":"IF(ISERROR(VLOOKUP(A92,AllExactPlacentaAll!$A$2:$A$221, 1, FALSE)),\"No\",\"Yes\")","v":"No"},1,"Ura et al., 2014"]
["193a-3p",{"$f":"IF(ISERROR(VLOOKUP(A93,AllExactPlacentaAll!$A$2:$A$221, 1, FALSE)),\"No\",\"Yes\")","v":"No"},1,"Ura et al., 2014"]
[668,{"$f":"IF(ISERROR(VLOOKUP(A94,AllExactPlacentaAll!$A$2:$A$221, 1, FALSE)),\"No\",\"Yes\")","v":"No"},1,"Ura et al., 2014"]
["376a",{"$f":"IF(ISERROR(VLOOKUP(A95,AllExactPlacentaAll!$A$2:$A$221, 1, FALSE)),\"No\",\"Yes\")","v":"No"},1,"Ura et al., 2014"]
["574-5p",{"$f":"IF(ISERROR(VLOOKUP(A96,AllExactPlacentaAll!$A$2:$A$221, 1, FALSE)),\"No\",\"Yes\")","v":"No"},1,"Wu et al., 2012"]
["130b",{"$f":"IF(ISERROR(VLOOKUP(A97,AllExactPlacentaAll!$A$2:$A$221, 1, FALSE)),\"No\",\"Yes\")","v":"No"},1,"Wu et al., 2012"]
[103,{"$f":"IF(ISERROR(VLOOKUP(A98,AllExactPlacentaAll!$A$2:$A$221, 1, FALSE)),\"No\",\"Yes\")","v":"No"},1,"Wu et al., 2012"]
[425,{"$f":"IF(ISERROR(VLOOKUP(A99,AllExactPlacentaAll!$A$2:$A$221, 1, FALSE)),\"No\",\"Yes\")","v":"No"},1,"Wu et al., 2012"]
[136,{"$f":"IF(ISERROR(VLOOKUP(A100,AllExactPlacentaAll!$A$2:$A$221, 1, FALSE)),\"No\",\"Yes\")","v":"No"},1,"Yang et al., 2011"]
["let-7f-1-star",{"$f":"IF(ISERROR(VLOOKUP(A101,AllExactPlacentaAll!$A$2:$A$221, 1, FALSE)),\"No\",\"Yes\")","v":"No"},1,"Yang et al., 2011"]
["let-7a-star",{"$f":"IF(ISERROR(VLOOKUP(A102,AllExactPlacentaAll!$A$2:$A$221, 1, FALSE)),\"No\",\"Yes\")","v":"No"},1,"Yang et al., 2011"]
[1260,{"$f":"IF(ISERROR(VLOOKUP(A103,AllExactPlacentaAll!$A$2:$A$221, 1, FALSE)),\"No\",\"Yes\")","v":"No"},1,"Yang et al., 2011"]
["let-7d",{"$f":"IF(ISERROR(VLOOKUP(A104,AllExactPlacentaAll!$A$2:$A$221, 1, FALSE)),\"No\",\"Yes\")","v":"No"},1,"Yang et al., 2011"]
[1272,{"$f":"IF(ISERROR(VLOOKUP(A105,AllExactPlacentaAll!$A$2:$A$221, 1, FALSE)),\"No\",\"Yes\")","v":"No"},1,"Yang et al., 2011"]

{"sheet":"ScreeningValidatedAllAll","index":5,"n_rows":54,"n_cols":7,"rows_kept":54}
["miR (exact)","Count","Studies",null,"miR (base)","Count","Studies (full miR name)"]
[210,4,"Enquobahrie et al., 2011, Ura et al., 2014, Xu et al., 2014, Zhu et al., 2009",null,210,4,"Enquobahrie et al., 2011 <210> Ura et al., 2014 <210> Xu et al., 2014 <210> Zhu et al., 2009 <210>"]
[16,3,"Hu et al., 2009, Wang, Y. et al. 2012, Zhao et al., 2014",null,29,4,"Hu et al., 2009 <29b> Li et al., 2013 <29a> Wang, Y. et al. 2012 <29b> Zhao et al., 2014 <29b>"]
["29b",3,"Hu et al., 2009, Wang, Y. et al. 2012, Zhao et al., 2014",null,26,3,"Choi et al., 2013 <26b> Hu et al., 2009 <26b> Wu et al., 2012 <26a>"]
["342-3p",2,"Choi et al., 2013, Wu et al., 2012",null,16,3,"Hu et al., 2009 <16> Wang, Y. et al. 2012 <16> Zhao et al., 2014 <16>"]
["26b",2,"Choi et al., 2013, Hu et al., 2009",null,30,3,"Wang, Y. et al. 2012 <30a> Xu et al., 2014 <30a-3p> Zhao et al., 2014 <30a>"]
[584,2,"Enquobahrie et al., 2011, Jiang et al., 2015",null,342,2,"Choi et al., 2013 <342-3p> Wu et al., 2012 <342-3p>"]
["181a",2,"Hu et al., 2009, Wu et al., 2012",null,296,2,"Choi et al., 2013 <296-5p,296-3p>"]
[195,2,"Hu et al., 2009, Xu et al., 2014",null,584,2,"Enquobahrie et al., 2011 <584> Jiang et al., 2015 <584>"]
[335,2,"Hu et al., 2009, Jiang et al., 2015",null,181,2,"Hu et al., 2009 <181a> Wu et al., 2012 <181a>"]
[221,2,"Li et al., 2013, Zhao et al., 2014",null,195,2,"Hu et al., 2009 <195> Xu et al., 2014 <195>"]
[144,2,"Li et al., 2013, Ura et al., 2014",null,335,2,"Hu et al., 2009 <335> Jiang et al., 2015 <335>"]
["30a",2,"Wang, Y. et al. 2012, Zhao et al., 2014",null,221,2,"Li et al., 2013 <221> Zhao et al., 2014 <221>"]
["518b",2,"Xu et al., 2014, Zhu et al., 2009",null,144,2,"Li et al., 2013 <144> Ura et al., 2014 <144>"]
["18a",2,"Xu et al., 2014, Zhu et al., 2009",null,223,2,"Weedon-Fekjær al., 2014 <223-3p> Xu et al., 2014 <223>"]
[411,2,"Xu et al., 2014, Zhu et al., 2009",null,518,2,"Xu et al., 2014 <518b> Zhu et al., 2009 <518b>"]
[363,2,"Zhang et al., 2015, Zhu et al., 2009",null,18,2,"Xu et al., 2014 <18a> Zhu et al., 2009 <18a>"]
["206-5p",1,"Akehurst et al., 2015",null,411,2,"Xu et al., 2014 <411> Zhu et al., 2009 <411>"]
["92b",1,"Choi et al., 2013",null,363,2,"Zhang et al., 2015 <363> Zhu et al., 2009 <363>"]
[197,1,"Choi et al., 2013",null,206,1,"Akehurst et al., 2015 <206-5p>"]
["296-5p",1,"Choi et al., 2013",null,92,1,"Choi et al., 2013 <92b>"]
[25,1,"Choi et al., 2013",null,197,1,"Choi et al., 2013 <197>"]
["296-3p",1,"Choi et al., 2013",null,25,1,"Choi et al., 2013 <25>"]
[1,1,"Enquobahrie et al., 2011",null,1,1,"Enquobahrie et al., 2011 <1>"]
[222,1,"Hu et al., 2009",null,222,1,"Hu et al., 2009 <222>"]
["29a",1,"Li et al., 2013",null,1233,1,"Ura et al., 2014 <1233>"]
[1233,1,"Ura et al., 2014",null,520,1,"Ura et al., 2014 <520a>"]
["520a",1,"Ura et al., 2014",null,20,1,"Wang, W. et al. 2012 <20b>"]
["20b",1,"Wang, W. et al. 2012",null,1301,1,"Weedon-Fekjær al., 2014 <1301>"]
[1301,1,"Weedon-Fekjær al., 2014",null,224,1,"Weedon-Fekjær al., 2014 <224-5p>"]
["223-3p",1,"Weedon-Fekjær al., 2014",null,574,1,"Wu et al., 2012 <574-5p>"]
["224-5p",1,"Weedon-Fekjær al., 2014",null,130,1,"Wu et al., 2012 <130b>"]
["574-5p",1,"Wu et al., 2012",null,103,1,"Wu et al., 2012 <103>"]
["26a",1,"Wu et al., 2012",null,24,1,"Wu et al., 2012 <24>"]
["130b",1,"Wu et al., 2012",null,151,1,"Xu et al., 2014 <151>"]
[103,1,"Wu et al., 2012",null,17,1,"Xu et al., 2014 <17-3p>"]
[24,1,"Wu et al., 2012",null,193,1,"Xu et al., 2014 <193b>"]
["30a-3p",1,"Xu et al., 2014",null,524,1,"Xu et al., 2014 <524>"]
[151,1,"Xu et al., 2014",null,218,1,"Xu et al., 2014 <218>"]
["17-3p",1,"Xu et al., 2014",null,379,1,"Xu et al., 2014 <379>"]
["193b",1,"Xu et al., 2014",null,136,1,"Zhao et al., 2014 <136>"]
[524,1,"Xu et al., 2014",null,494,1,"Zhao et al., 2014 <494>"]
[218,1,"Xu et al., 2014",null,100,1,"Zhao et al., 2014 <100>"]
[379,1,"Xu et al., 2014",null,140,1,"Zhao et al., 2014 <140-5p>"]
[223,1,"Xu et al., 2014",null,495,1,"Zhao et al., 2014 <495>"]
[136,1,"Zhao et al., 2014",null,1207,1,"Zhao et al., 2014 <1207>"]
[494,1,"Zhao et al., 2014",null,152,1,"Zhu et al., 2009 <152>"]
[100,1,"Zhao et al., 2014",null,377,1,"Zhu et al., 2009 <377>"]
["140-5p",1,"Zhao et al., 2014",null,542,1,"Zhu et al., 2009 <542-3p>"]
[495,1,"Zhao et al., 2014"]
[1207,1,"Zhao et al., 2014"]
[152,1,"Zhu et al., 2009"]
[377,1,"Zhu et al., 2009"]
["542-3p",1,"Zhu et al., 2009"]

{"sheet":"CandidateExactAllAll","index":6,"n_rows":88,"n_cols":3,"rows_kept":88}
["microRNA","Cited","Studies"]
[210,12,"Anton et al., 2013, Betoni et al., 2013, Enquobahrie et al., 2015, Gunel et al., 2011, Lalevée et al., 2014, Lee et al., 2011, Luo et al., 2014, Muralimanoharan et al., 2012, Murphy et al., 2015, Xu et al., 2014, Zhang et al., 2012, Zhu et al., 2009"]
["518b",4,"Hromadnikova et al., 2015a, Miura et al., 2015, Xu et al., 2014, Zhu et al., 2009"]
[223,3,"Enquobahrie et al., 2015, Winger et al., 2015, Xu et al., 2014"]
[155,3,"Li, X. et al. 2014, Murphy et al., 2015, Zhang et al., 2010"]
[195,2,"Bai et al., 2012, Xu et al., 2014"]
["34a",2,"Doridot et al., 2014, Sun et al., 2015"]
[126,2,"Hong et al., 2014, Yan et al., 2013"]
["515-5p",2,"Hromadnikova et al., 2015a, Miura et al., 2015"]
["520a-5p",2,"Hromadnikova et al., 2015a, Miura et al., 2015"]
["520h",2,"Hromadnikova et al., 2015a, Miura et al., 2015"]
[525,2,"Hromadnikova et al., 2015a, Hromadnikova et al., 2013"]
["526a",2,"Hromadnikova et al., 2015a, Hromadnikova et al., 2013"]
["106a",2,"Kumar et al., 2013, Zhang et al., 2015"]
["19b",2,"Kumar et al., 2013, Zhang et al., 2015"]
[141,2,"Li et al., 2013, Pan et al., 2012"]
[221,2,"Li et al., 2013, Pan et al., 2012"]
["181a",2,"Liu et al., 2012, Murphy et al., 2015"]
[17,2,"Wang, W. et al. 2012, Xu et al., 2014"]
["20a",2,"Wang, W. et al. 2012, Wang et al., 2014"]
["20b",2,"Wang, W. et al. 2012, Zhang et al., 2015"]
["18a",2,"Xu et al., 2014, Zhu et al., 2009"]
[411,2,"Xu et al., 2014, Zhu et al., 2009"]
[363,2,"Zhang et al., 2015, Zhu et al., 2009"]
["517a/b",1,"Anton et al., 2015"]
["517c",1,"Anton et al., 2015"]
["182*",1,"Betoni et al., 2013"]
["196b",1,"Campos et al., 2014"]
["519d-3p",1,"Ding et al., 2015"]
["376c",1,"Fu et al., 2013"]
[675,1,"Gao et al., 2012"]
["517-5p",1,"Hromadnikova et al., 2015a"]
["519a",1,"Hromadnikova et al., 2015a"]
["524-5p",1,"Hromadnikova et al., 2015a"]
["499a-5p",1,"Hromadnikova et al., 2015b"]
["1-3p",1,"Hromadnikova et al., 2015b"]
["26a-5p",1,"Hromadnikova et al., 2015b"]
["103a-3p",1,"Hromadnikova et al., 2015b"]
["145-5p",1,"Hromadnikova et al., 2015b"]
["516-5p",1,"Hromadnikova et al., 2013"]
["517*",1,"Hromadnikova et al., 2013"]
["520a*",1,"Hromadnikova et al., 2013"]
["455-3P",1,"Lalevée et al., 2014"]
["455-5P",1,"Lalevée et al., 2014"]
[325,1,"Lazar et al., 2012"]
["29a",1,"Li et al., 2013"]
[144,1,"Li et al., 2013"]
["125b-1-3p",1,"Li, Q. et al. 2014"]
["378a-5p",1,"Luo et al., 2012"]
[1323,1,"Miura et al., 2015"]
["516b",1,"Miura et al., 2015"]
["516a-5p",1,"Miura et al., 2015"]
["525-5p",1,"Miura et al., 2015"]
["519d",1,"Miura et al., 2015"]
["526b",1,"Miura et al., 2015"]
["296-3p",1,"Murphy et al., 2015"]
["181a-5p",1,"Murphy et al., 2015"]
[98,1,"Murphy et al., 2015"]
[222,1,"Murphy et al., 2015"]
[296,1,"Murphy et al., 2015"]
["29b",1,"Murphy et al., 2015"]
[149,1,"Pan et al., 2012"]
[1229,1,"Winger et al., 2015"]
[1267,1,"Winger et al., 2015"]
["148a-3p",1,"Winger et al., 2015"]
[16,1,"Winger et al., 2015"]
["199b-5p",1,"Winger et al., 2015"]
["30e-3p",1,"Winger et al., 2015"]
["301a-3p",1,"Winger et al., 2015"]
["340-5p",1,"Winger et al., 2015"]
["424-5p",1,"Winger et al., 2015"]
["30a-3p",1,"Xu et al., 2014"]
[524,1,"Xu et al., 2014"]
["17-3p",1,"Xu et al., 2014"]
[151,1,"Xu et al., 2014"]
["193b",1,"Xu et al., 2014"]
[214,1,"Xu et al., 2014"]
[218,1,"Xu et al., 2014"]
[379,1,"Xu et al., 2014"]
["519e-5p",1,"Xu et al., 2014"]
["19b1",1,"Xu et al., 2014"]
["92a1",1,"Xu et al., 2014"]
["18b",1,"Zhang et al., 2015"]
["92a",1,"Zhang et al., 2015"]
[152,1,"Zhu et al., 2009"]
[377,1,"Zhu et al., 2009"]
["542-3p",1,"Zhu et al., 2009"]
[101,1,"Zou et al., 2014"]

{"sheet":"CandidateExactChorionicBasalAll","index":7,"n_rows":5,"n_cols":4,"rows_kept":5}
["CHORIONIC PLATE (FETAL)","BOTH (CHORIONIC AND BASAL)","BASAL PLATE (MATERNAL)","REFERENCE"]
[null,null,"125b-1-3p","Li, Q. et al. 2014"]
[null,null,210,"Luo et al., 2014"]
["195, 18a, 379, 519e-5p, 17, 19b, 92a","223, 218, 411","210, 30a-3p, 518b, 524, 17-3p, 151, 193b, 214","Xu et al., 2014"]
["18b, 19b","20b, 92a, 363","106a","Zhang et al., 2015"]

{"sheet":"AllValidatedAllAll","index":8,"n_rows":115,"n_cols":3,"rows_kept":115}
["miR","Total","Studies"]
[210,16,"Enquobahrie et al., 2011, Ura et al., 2014, Xu et al., 2014, Zhu et al., 2009, Anton et al., 2013 (C), Betoni et al., 2013 (C), Enquobahrie et al., 2015 (C), Gunel et al., 2011 (C), Lalevée et al., 2014 (C), Lee et al., 2011 (C), Luo et al., 2014 (C), Muralimanoharan et al., 2012 (C), Murphy et al., 2015 (C), Xu et al., 2014 (C), Zhang et al., 2012 (C), Zhu et al., 2009 (C)"]
["518b",6,"Xu et al., 2014, Zhu et al., 2009, Hromadnikova et al., 2015a (C), Miura et al., 2015 (C), Xu et al., 2014 (C), Zhu et al., 2009 (C)"]
["181a",4,"Hu et al., 2009, Wu et al., 2012, Liu et al., 2012 (C), Murphy et al., 2015 (C)"]
[195,4,"Hu et al., 2009, Xu et al., 2014, Bai et al., 2012 (C), Xu et al., 2014 (C)"]
[16,4,"Hu et al., 2009, Wang, Y. et al. 2012, Zhao et al., 2014, Winger et al., 2015 (C)"]
["29b",4,"Hu et al., 2009, Wang, Y. et al. 2012, Zhao et al., 2014, Murphy et al., 2015 (C)"]
[221,4,"Li et al., 2013, Zhao et al., 2014, Li et al., 2013 (C), Pan et al., 2012 (C)"]
["18a",4,"Xu et al., 2014, Zhu et al., 2009, Xu et al., 2014 (C), Zhu et al., 2009 (C)"]
[411,4,"Xu et al., 2014, Zhu et al., 2009, Xu et al., 2014 (C), Zhu et al., 2009 (C)"]
[223,4,"Xu et al., 2014, Enquobahrie et al., 2015 (C), Winger et al., 2015 (C), Xu et al., 2014 (C)"]
[363,4,"Zhang et al., 2015, Zhu et al., 2009, Zhang et al., 2015 (C), Zhu et al., 2009 (C)"]
[144,3,"Li et al., 2013, Ura et al., 2014, Li et al., 2013 (C)"]
["20b",3,"Wang, W. et al. 2012, Wang, W. et al. 2012 (C), Zhang et al., 2015 (C)"]
[155,3,"Li, X. et al. 2014 (C), Murphy et al., 2015 (C), Zhang et al., 2010 (C)"]
["342-3p",2,"Choi et al., 2013, Wu et al., 2012"]
["26b",2,"Choi et al., 2013, Hu et al., 2009"]
["296-3p",2,"Choi et al., 2013, Murphy et al., 2015 (C)"]
[584,2,"Enquobahrie et al., 2011, Jiang et al., 2015"]
[222,2,"Hu et al., 2009, Murphy et al., 2015 (C)"]
[335,2,"Hu et al., 2009, Jiang et al., 2015"]
["29a",2,"Li et al., 2013, Li et al., 2013 (C)"]
["30a",2,"Wang, Y. et al. 2012, Zhao et al., 2014"]
["30a-3p",2,"Xu et al., 2014, Xu et al., 2014 (C)"]
[151,2,"Xu et al., 2014, Xu et al., 2014 (C)"]
["17-3p",2,"Xu et al., 2014, Xu et al., 2014 (C)"]
["193b",2,"Xu et al., 2014, Xu et al., 2014 (C)"]
[524,2,"Xu et al., 2014, Xu et al., 2014 (C)"]
[218,2,"Xu et al., 2014, Xu et al., 2014 (C)"]
[379,2,"Xu et al., 2014, Xu et al., 2014 (C)"]
[152,2,"Zhu et al., 2009, Zhu et al., 2009 (C)"]
[377,2,"Zhu et al., 2009, Zhu et al., 2009 (C)"]
["542-3p",2,"Zhu et al., 2009, Zhu et al., 2009 (C)"]
["34a",2,"Doridot et al., 2014 (C), Sun et al., 2015 (C)"]
[126,2,"Hong et al., 2014 (C), Yan et al., 2013 (C)"]
["515-5p",2,"Hromadnikova et al., 2015a (C), Miura et al., 2015 (C)"]
["520a-5p",2,"Hromadnikova et al., 2015a (C), Miura et al., 2015 (C)"]
["520h",2,"Hromadnikova et al., 2015a (C), Miura et al., 2015 (C)"]
[525,2,"Hromadnikova et al., 2015a (C), Hromadnikova et al., 2013 (C)"]
["526a",2,"Hromadnikova et al., 2015a (C), Hromadnikova et al., 2013 (C)"]
["106a",2,"Kumar et al., 2013 (C), Zhang et al., 2015 (C)"]
["19b",2,"Kumar et al., 2013 (C), Zhang et al., 2015 (C)"]
[141,2,"Li et al., 2013 (C), Pan et al., 2012 (C)"]
[17,2,"Wang, W. et al. 2012 (C), Xu et al., 2014 (C)"]
["20a",2,"Wang, W. et al. 2012 (C), Wang et al., 2014 (C)"]
["206-5p",1,"Akehurst et al., 2015"]
["92b",1,"Choi et al., 2013"]
[197,1,"Choi et al., 2013"]
["296-5p",1,"Choi et al., 2013"]
[25,1,"Choi et al., 2013"]
[1,1,"Enquobahrie et al., 2011"]
[1233,1,"Ura et al., 2014"]
["520a",1,"Ura et al., 2014"]
[1301,1,"Weedon-Fekjær al., 2014"]
["223-3p",1,"Weedon-Fekjær al., 2014"]
["224-5p",1,"Weedon-Fekjær al., 2014"]
["574-5p",1,"Wu et al., 2012"]
["26a",1,"Wu et al., 2012"]
["130b",1,"Wu et al., 2012"]
[103,1,"Wu et al., 2012"]
[24,1,"Wu et al., 2012"]
[136,1,"Zhao et al., 2014"]
[494,1,"Zhao et al., 2014"]
[100,1,"Zhao et al., 2014"]
["140-5p",1,"Zhao et al., 2014"]
[495,1,"Zhao et al., 2014"]
[1207,1,"Zhao et al., 2014"]
["517a/b",1,"Anton et al., 2015 (C)"]
["517c",1,"Anton et al., 2015 (C)"]
["182*",1,"Betoni et al., 2013 (C)"]
["196b",1,"Campos et al., 2014 (C)"]
["519d-3p",1,"Ding et al., 2015 (C)"]
["376c",1,"Fu et al., 2013 (C)"]
[675,1,"Gao et al., 2012 (C)"]
["517-5p",1,"Hromadnikova et al., 2015a (C)"]
["519a",1,"Hromadnikova et al., 2015a (C)"]
["524-5p",1,"Hromadnikova et al., 2015a (C)"]
["499a-5p",1,"Hromadnikova et al., 2015b (C)"]
["1-3p",1,"Hromadnikova et al., 2015b (C)"]
["26a-5p",1,"Hromadnikova et al., 2015b (C)"]
["103a-3p",1,"Hromadnikova et al., 2015b (C)"]
["145-5p",1,"Hromadnikova et al., 2015b (C)"]
["516-5p",1,"Hromadnikova et al., 2013 (C)"]
["517*",1,"Hromadnikova et al., 2013 (C)"]
["520a*",1,"Hromadnikova et al., 2013 (C)"]
["455-3P",1,"Lalevée et al., 2014 (C)"]
["455-5P",1,"Lalevée et al., 2014 (C)"]
[325,1,"Lazar et al., 2012 (C)"]
["125b-1-3p",1,"Li, Q. et al. 2014 (C)"]
["378a-5p",1,"Luo et al., 2012 (C)"]
[1323,1,"Miura et al., 2015 (C)"]
["516b",1,"Miura et al., 2015 (C)"]
["516a-5p",1,"Miura et al., 2015 (C)"]
["525-5p",1,"Miura et al., 2015 (C)"]
["519d",1,"Miura et al., 2015 (C)"]
["526b",1,"Miura et al., 2015 (C)"]
["181a-5p",1,"Murphy et al., 2015 (C)"]
[98,1,"Murphy et al., 2015 (C)"]
[296,1,"Murphy et al., 2015 (C)"]
[149,1,"Pan et al., 2012 (C)"]
[1229,1,"Winger et al., 2015 (C)"]
[1267,1,"Winger et al., 2015 (C)"]
["148a-3p",1,"Winger et al., 2015 (C)"]
["199b-5p",1,"Winger et al., 2015 (C)"]
["30e-3p",1,"Winger et al., 2015 (C)"]
["301a-3p",1,"Winger et al., 2015 (C)"]
["340-5p",1,"Winger et al., 2015 (C)"]
["424-5p",1,"Winger et al., 2015 (C)"]
[214,1,"Xu et al., 2014 (C)"]
["519e-5p",1,"Xu et al., 2014 (C)"]
["19b1",1,"Xu et al., 2014 (C)"]
["92a1",1,"Xu et al., 2014 (C)"]
["18b",1,"Zhang et al., 2015 (C)"]
["92a",1,"Zhang et al., 2015 (C)"]
[101,1,"Zou et al., 2014 (C)"]

{"sheet":"AllExactPlacentaAll","index":9,"n_rows":221,"n_cols":3,"rows_kept":221}
["miR","Cited","Studies"]
[210,8,"Enquobahrie et al., 2011, Ishibashi et al., 2012, Jiang et al., 2015, Pineles et al., 2007, Weedon-Fekjær al., 2014, Xu et al., 2014, Zhang et al., 2015, Zhu et al., 2009"]
[223,6,"Betoni et al., 2013, Choi et al., 2013, Guo et al., 2011, Mayor-Lynn et al., 2011, Xu et al., 2014, Zhu et al., 2009"]
["181a",5,"Hu et al., 2009, Jiang et al., 2015, Xu et al., 2014, Zhang et al., 2015, Zhu et al., 2009"]
["126*",4,"Guo et al., 2011, Ishibashi et al., 2012, Yang et al., 2015, Zhu et al., 2009"]
["518b",4,"Guo et al., 2011, Mayor-Lynn et al., 2011, Xu et al., 2014, Zhu et al., 2009"]
["18a",4,"Ishibashi et al., 2012, Xu et al., 2014, Yang et al., 2015, Zhu et al., 2009"]
["517c",3,"Guo et al., 2011, Ishibashi et al., 2012, Yang et al., 2015"]
[335,3,"Hu et al., 2009, Jiang et al., 2015, Zhang et al., 2015"]
[126,3,"Hu et al., 2009, Jiang et al., 2015, Yang et al., 2015"]
["19a",3,"Ishibashi et al., 2012, Xu et al., 2014, Zhu et al., 2009"]
["519e*",3,"Ishibashi et al., 2012, Xu et al., 2014, Zhu et al., 2009"]
[182,3,"Jiang et al., 2015, Pineles et al., 2007, Zhang et al., 2015"]
[101,2,"Betoni et al., 2013, Zhu et al., 2009"]
["26b",2,"Choi et al., 2013, Hu et al., 2009"]
[204,2,"Choi et al., 2013, Zhu et al., 2009"]
[21,2,"Choi et al., 2013, Jiang et al., 2015"]
["130a",2,"Guo et al., 2011, Yang et al., 2015"]
["29a",2,"Guo et al., 2011, Yang et al., 2015"]
["518e",2,"Guo et al., 2011, Yang et al., 2015"]
["30d",2,"Guo et al., 2011, Mayor-Lynn et al., 2011"]
[149,2,"Guo et al., 2013, Yang et al., 2015"]
[16,2,"Hu et al., 2009, Zhang et al., 2015"]
["27a",2,"Hu et al., 2009, Yang et al., 2015"]
[451,2,"Hu et al., 2009, Ishibashi et al., 2012"]
["142-3p",2,"Ishibashi et al., 2012, Yang et al., 2015"]
[224,2,"Ishibashi et al., 2012, Yang et al., 2015"]
[152,2,"Jiang et al., 2015, Zhu et al., 2009"]
[32,2,"Jiang et al., 2015, Zhu et al., 2009"]
["542-3p",2,"Xu et al., 2014, Zhu et al., 2009"]
["18b",2,"Yang et al., 2015, Zhu et al., 2009"]
["342-3p",1,"Choi et al., 2013"]
["296-5p",1,"Choi et al., 2013"]
[25,1,"Choi et al., 2013"]
["26a",1,"Choi et al., 2013"]
["125b",1,"Guo et al., 2011"]
["29c",1,"Guo et al., 2011"]
["29b",1,"Hu et al., 2009"]
["520g",1,"Hu et al., 2009"]
["144*",1,"Ishibashi et al., 2012"]
[185,1,"Ishibashi et al., 2012"]
["518c",1,"Ishibashi et al., 2012"]
[378,1,"Mayor-Lynn et al., 2011"]
[24,1,"Mayor-Lynn et al., 2011"]
["151-3p",1,"Wang, W. et al. 2012"]
["525*",1,"Xu et al., 2014"]
["515-3p",1,"Xu et al., 2014"]
["135b",1,"Yang et al., 2015"]
["188-5p",1,"Yang et al., 2015"]
["301a",1,"Yang et al., 2015"]
[203,1,"Yang et al., 2015"]
[205,1,"Yang et al., 2015"]
["518a-3p",1,"Yang et al., 2015"]
["519d",1,"Yang et al., 2015"]
[93,1,"Yang et al., 2015"]
["19b",1,"Zhang et al., 2015"]
[424,1,"Zhang et al., 2015"]
["517*",1,"Zhu et al., 2009"]
[144,1,"Zhu et al., 2009"]
[584,5,"Enquobahrie et al., 2011, Jiang et al., 2015, Xu et al., 2014, Zhang et al., 2015, Zhu et al., 2009"]
[363,4,"Betoni et al., 2013, Xu et al., 2014, Zhang et al., 2015, Zhu et al., 2009"]
[1,3,"Enquobahrie et al., 2011, Zhang et al., 2015, Zhu et al., 2009"]
[195,3,"Hu et al., 2009, Xu et al., 2014, Zhu et al., 2009"]
[493,2,"Betoni et al., 2013, Mayor-Lynn et al., 2011"]
["34c-5p",2,"Enquobahrie et al., 2011, Wang, W. et al. 2012"]
[141,2,"Guo et al., 2011, Hu et al., 2009"]
["517a",2,"Guo et al., 2011, Mayor-Lynn et al., 2011"]
[22,2,"Guo et al., 2011, Ishibashi et al., 2012"]
["20b",2,"Hu et al., 2009, Wang, W. et al. 2012"]
[214,2,"Hu et al., 2009, Xu et al., 2014"]
["193b",2,"Ishibashi et al., 2012, Xu et al., 2014"]
["526b",2,"Ishibashi et al., 2012, Mayor-Lynn et al., 2011"]
["10b",2,"Ishibashi et al., 2012, Zhu et al., 2009"]
["20a",2,"Ishibashi et al., 2012, Zhang et al., 2015"]
["146b-5p",2,"Ishibashi et al., 2012, Mayor-Lynn et al., 2011"]
[377,2,"Jiang et al., 2015, Zhu et al., 2009"]
["146a",2,"Mayor-Lynn et al., 2011, Wang, W. et al. 2012"]
["512-3p",2,"Mayor-Lynn et al., 2011, Wang, W. et al. 2012"]
["30a-3p",2,"Xu et al., 2014, Zhu et al., 2009"]
[638,2,"Xu et al., 2014, Zhu et al., 2009"]
[296,2,"Xu et al., 2014, Zhu et al., 2009"]
[362,2,"Xu et al., 2014, Zhu et al., 2009"]
[218,2,"Xu et al., 2014, Zhu et al., 2009"]
[590,2,"Xu et al., 2014, Zhu et al., 2009"]
[411,2,"Xu et al., 2014, Zhu et al., 2009"]
[7,1,"Betoni et al., 2013"]
[585,1,"Betoni et al., 2013"]
["199b-5p",1,"Betoni et al., 2013"]
["520f",1,"Betoni et al., 2013"]
["520c-3p",1,"Betoni et al., 2013"]
["196b",1,"Betoni et al., 2013"]
[128,1,"Betoni et al., 2013"]
["551b",1,"Betoni et al., 2013"]
["140-5p",1,"Betoni et al., 2013"]
["92b",1,"Choi et al., 2013"]
[197,1,"Choi et al., 2013"]
["296-3p",1,"Choi et al., 2013"]
[198,1,"Choi et al., 2013"]
[202,1,"Choi et al., 2013"]
[191,1,"Choi et al., 2013"]
[95,1,"Choi et al., 2013"]
[328,1,"Enquobahrie et al., 2011"]
["139-5p",1,"Enquobahrie et al., 2011"]
[500,1,"Enquobahrie et al., 2011"]
[1247,1,"Enquobahrie et al., 2011"]
[143,1,"Guo et al., 2011"]
[525,1,"Guo et al., 2011"]
[194,1,"Guo et al., 2013"]
[222,1,"Hu et al., 2009"]
["7f",1,"Hu et al., 2009"]
[565,1,"Hu et al., 2009"]
["519b-3p",1,"Hu et al., 2009"]
["450a",1,"Hu et al., 2009"]
["30e",1,"Hu et al., 2009"]
[522,1,"Hu et al., 2009"]
["486-3p",1,"Hu et al., 2009"]
[658,1,"Hu et al., 2009"]
["523-3p",1,"Hu et al., 2009"]
["423-5p",1,"Hu et al., 2009"]
["491-5p",1,"Hu et al., 2009"]
[612,1,"Hu et al., 2009"]
["508-5p",1,"Hu et al., 2009"]
["193b*",1,"Ishibashi et al., 2012"]
["590-5p",1,"Ishibashi et al., 2012"]
["520a-3p",1,"Ishibashi et al., 2012"]
["518f",1,"Ishibashi et al., 2012"]
["525-5p",1,"Ishibashi et al., 2012"]
["451a",1,"Jiang et al., 2015"]
[17,1,"Jiang et al., 2015"]
[516,1,"Jiang et al., 2015"]
["135a",1,"Jiang et al., 2015"]
[96,1,"Jiang et al., 2015"]
[196,1,"Jiang et al., 2015"]
["362-3p",1,"Jiang et al., 2015"]
[496,1,"Mayor-Lynn et al., 2011"]
[431,1,"Mayor-Lynn et al., 2011"]
[720,1,"Mayor-Lynn et al., 2011"]
["654-3p",1,"Mayor-Lynn et al., 2011"]
["181d",1,"Mayor-Lynn et al., 2011"]
["145*",1,"Mayor-Lynn et al., 2011"]
[539,1,"Mayor-Lynn et al., 2011"]
["let-7e",1,"Mayor-Lynn et al., 2011"]
[495,1,"Mayor-Lynn et al., 2011"]
["let-7b",1,"Noack et al., 2011"]
["302*",1,"Noack et al., 2011"]
[104,1,"Noack et al., 2011"]
["128a",1,"Noack et al., 2011"]
["182*",1,"Noack et al., 2011"]
["133b",1,"Noack et al., 2011"]
["516a-5p",1,"Wang, W. et al. 2012"]
[2277,1,"Wang, W. et al. 2012"]
["524-3p",1,"Wang, W. et al. 2012"]
[192,1,"Wang, W. et al. 2012"]
[1301,1,"Weedon-Fekjær al., 2014"]
["223-3p",1,"Weedon-Fekjær al., 2014"]
["224-5p",1,"Weedon-Fekjær al., 2014"]
[151,1,"Xu et al., 2014"]
[31,1,"Xu et al., 2014"]
["17-3p",1,"Xu et al., 2014"]
[524,1,"Xu et al., 2014"]
[379,1,"Xu et al., 2014"]
["125b-1-3p",1,"Zhang et al., 2015"]
[355,1,"Zhang et al., 2015"]
[1469,1,"Zhang et al., 2015"]
["29a-3p",1,"Zhang et al., 2015"]
["200c",1,"Zhang et al., 2015"]
[744,1,"Zhang et al., 2015"]
[1826,1,"Zhang et al., 2015"]
["154*",1,"Zhu et al., 2009"]
[625,1,"Zhu et al., 2009"]
[150,1,"Zhu et al., 2009"]
[450,1,"Zhu et al., 2009"]
[374,1,"Zhu et al., 2009"]
[210,8,"Betoni et al., 2013 (C), Enquobahrie et al., 2015 (C), Lalevée et al., 2014 (C), Lee et al., 2011 (C), Luo et al., 2014 (C), Muralimanoharan et al., 2012 (C), Xu et al., 2014 (C), Zhu et al., 2009 (C)"]
[195,2,"Bai et al., 2012 (C), Xu et al., 2014 (C)"]
["34a",2,"Doridot et al., 2014 (C), Sun et al., 2015 (C)"]
[223,2,"Enquobahrie et al., 2015 (C), Xu et al., 2014 (C)"]
[126,2,"Hong et al., 2014 (C), Yan et al., 2013 (C)"]
["106a",2,"Kumar et al., 2013 (C), Zhang et al., 2015 (C)"]
["19b",2,"Kumar et al., 2013 (C), Zhang et al., 2015 (C)"]
[155,2,"Li, X. et al. 2014 (C), Zhang et al., 2010 (C)"]
[17,2,"Wang, W. et al. 2012 (C), Xu et al., 2014 (C)"]
["20a",2,"Wang, W. et al. 2012 (C), Wang et al., 2014 (C)"]
["20b",2,"Wang, W. et al. 2012 (C), Zhang et al., 2015 (C)"]
["518b",2,"Xu et al., 2014 (C), Zhu et al., 2009 (C)"]
["18a",2,"Xu et al., 2014 (C), Zhu et al., 2009 (C)"]
[411,2,"Xu et al., 2014 (C), Zhu et al., 2009 (C)"]
[363,2,"Zhang et al., 2015 (C), Zhu et al., 2009 (C)"]
["517a/b",1,"Anton et al., 2015 (C)"]
["517c",1,"Anton et al., 2015 (C)"]
["182*",1,"Betoni et al., 2013 (C)"]
["519d-3p",1,"Ding et al., 2015 (C)"]
[675,1,"Gao et al., 2012 (C)"]
["499a-5p",1,"Hromadnikova et al., 2015b (C)"]
["1-3p",1,"Hromadnikova et al., 2015b (C)"]
["26a-5p",1,"Hromadnikova et al., 2015b (C)"]
["103a-3p",1,"Hromadnikova et al., 2015b (C)"]
["145-5p",1,"Hromadnikova et al., 2015b (C)"]
["455-3P",1,"Lalevée et al., 2014 (C)"]
["455-5P",1,"Lalevée et al., 2014 (C)"]
[325,1,"Lazar et al., 2012 (C)"]
["125b-1-3p",1,"Li, Q. et al. 2014 (C)"]
["181a",1,"Liu et al., 2012 (C)"]
["378a-5p",1,"Luo et al., 2012 (C)"]
["30a-3p",1,"Xu et al., 2014 (C)"]
[524,1,"Xu et al., 2014 (C)"]
["17-3p",1,"Xu et al., 2014 (C)"]
[151,1,"Xu et al., 2014 (C)"]
["193b",1,"Xu et al., 2014 (C)"]
[214,1,"Xu et al., 2014 (C)"]
[218,1,"Xu et al., 2014 (C)"]
[379,1,"Xu et al., 2014 (C)"]
["519e-5p",1,"Xu et al., 2014 (C)"]
["19b1",1,"Xu et al., 2014 (C)"]
["92a1",1,"Xu et al., 2014 (C)"]
["18b",1,"Zhang et al., 2015 (C)"]
["92a",1,"Zhang et al., 2015 (C)"]
[152,1,"Zhu et al., 2009 (C)"]
[377,1,"Zhu et al., 2009 (C)"]
["542-3p",1,"Zhu et al., 2009 (C)"]
[101,1,"Zou et al., 2014 (C)"]

{"sheet":"AllExactCirculationAll","index":10,"n_rows":152,"n_cols":3,"rows_kept":152}
["miR","Cited","Studies"]
["519d",3,"Li et al., 2013, Yang et al., 2011, Yang et al., 2015"]
["517c",3,"Li et al., 2013, Yang et al., 2011, Yang et al., 2015"]
["29a",3,"Li et al., 2013, Yang et al., 2011, Yang et al., 2015"]
[144,3,"Li et al., 2013, Ura et al., 2014, Wu et al., 2012"]
["130a",3,"Li et al., 2013, Wu et al., 2012, Yang et al., 2015"]
["18a",2,"Li et al., 2013, Yang et al., 2015"]
["125b",2,"Li et al., 2013, Yang et al., 2011"]
["27a",2,"Li et al., 2013, Yang et al., 2015"]
[24,2,"Li et al., 2013, Wu et al., 2012"]
["518b",2,"Li et al., 2013, Ura et al., 2014"]
[25,2,"Li et al., 2013, Ura et al., 2014"]
[223,2,"Li et al., 2013, Yang et al., 2011"]
[185,2,"Li et al., 2013, Yang et al., 2011"]
[126,2,"Ura et al., 2014, Yang et al., 2015"]
["518e",2,"Yang et al., 2011, Yang et al., 2015"]
["19a",1,"Li et al., 2013"]
[101,1,"Li et al., 2013"]
["26b",1,"Li et al., 2013"]
[378,1,"Li et al., 2013"]
["144*",1,"Li et al., 2013"]
[182,1,"Li et al., 2013"]
["29c",1,"Li et al., 2013"]
["518c",1,"Li et al., 2013"]
["515-3p",1,"Li et al., 2013"]
[424,1,"Li et al., 2013"]
["29b",1,"Li et al., 2013"]
[21,1,"Li et al., 2013"]
["19b",1,"Li et al., 2013"]
[451,1,"Li et al., 2013"]
[210,1,"Ura et al., 2014"]
[32,1,"Ura et al., 2014"]
[204,1,"Ura et al., 2014"]
["296-5p",1,"Ura et al., 2014"]
[152,1,"Ura et al., 2014"]
[335,1,"Ura et al., 2014"]
["26a",1,"Wu et al., 2012"]
["151-3p",1,"Wu et al., 2012"]
["181a",1,"Wu et al., 2012"]
["30d",1,"Wu et al., 2012"]
["342-3p",1,"Wu et al., 2012"]
[16,1,"Wu et al., 2012"]
["520g",1,"Yang et al., 2011"]
["542-3p",1,"Yang et al., 2011"]
["135b",1,"Yang et al., 2015"]
[149,1,"Yang et al., 2015"]
["188-5p",1,"Yang et al., 2015"]
["18b",1,"Yang et al., 2015"]
[203,1,"Yang et al., 2015"]
[205,1,"Yang et al., 2015"]
[224,1,"Yang et al., 2015"]
["301a",1,"Yang et al., 2015"]
["518a-3p",1,"Yang et al., 2015"]
["126*",1,"Yang et al., 2015"]
["142-3p",1,"Yang et al., 2015"]
[93,1,"Yang et al., 2015"]
["517b",2,"Li et al., 2013, Yang et al., 2011"]
[221,2,"Li et al., 2013, Wu et al., 2012"]
[521,2,"Li et al., 2013, Yang et al., 2011"]
["519a",2,"Li et al., 2013, Yang et al., 2011"]
["520h",2,"Li et al., 2013, Yang et al., 2011"]
["125a-5p",2,"Li et al., 2013, Yang et al., 2011"]
[145,2,"Li et al., 2013, Wu et al., 2012"]
["15b",2,"Li et al., 2013, Ura et al., 2014"]
["320c",2,"Li et al., 2013, Yang et al., 2011"]
["let-7f",2,"Li et al., 2013, Yang et al., 2011"]
["23a*",1,"Akehurst et al., 2015"]
["196b-5p",1,"Akehurst et al., 2015"]
["206-5p",1,"Akehurst et al., 2015"]
["502-5p",1,"Akehurst et al., 2015"]
["503-5p",1,"Akehurst et al., 2015"]
["758-3p",1,"Akehurst et al., 2015"]
["10a",1,"Li et al., 2013"]
[114,1,"Li et al., 2013"]
["15b*",1,"Li et al., 2013"]
["30a",1,"Li et al., 2013"]
["519e",1,"Li et al., 2013"]
["299a-5p",1,"Li et al., 2013"]
["23a",1,"Li et al., 2013"]
["23b",1,"Li et al., 2013"]
["34a",1,"Li et al., 2013"]
["525-3p",1,"Li et al., 2013"]
["199a-5p",1,"Li et al., 2013"]
[100,1,"Li et al., 2013"]
["99a",1,"Li et al., 2013"]
["512-5p",1,"Li et al., 2013"]
["30b",1,"Li et al., 2013"]
[107,1,"Li et al., 2013"]
[1233,1,"Ura et al., 2014"]
[650,1,"Ura et al., 2014"]
["520a",1,"Ura et al., 2014"]
[215,1,"Ura et al., 2014"]
["193a-3p",1,"Ura et al., 2014"]
[668,1,"Ura et al., 2014"]
["376a",1,"Ura et al., 2014"]
["574-5p",1,"Wu et al., 2012"]
["130b",1,"Wu et al., 2012"]
[103,1,"Wu et al., 2012"]
[425,1,"Wu et al., 2012"]
[136,1,"Yang et al., 2011"]
["let-7f-1-star",1,"Yang et al., 2011"]
["let-7a-star",1,"Yang et al., 2011"]
[1260,1,"Yang et al., 2011"]
["let-7d",1,"Yang et al., 2011"]
[1272,1,"Yang et al., 2011"]
[210,5,"Anton et al., 2013 (C), Gunel et al., 2011 (C), Murphy et al., 2015 (C), Xu et al., 2014 (C), Zhang et al., 2012 (C) "]
["515-5p",2,"Hromadnikova et al., 2015a (C), Miura et al., 2015 (C) "]
["518b",2,"Hromadnikova et al., 2015a (C), Miura et al., 2015 (C) "]
["520a-5p",2,"Hromadnikova et al., 2015a (C), Miura et al., 2015 (C) "]
["520h",2,"Hromadnikova et al., 2015a (C), Miura et al., 2015 (C) "]
[525,2,"Hromadnikova et al., 2015a (C), Hromadnikova et al., 2013 (C) "]
["526a",2,"Hromadnikova et al., 2015a (C), Hromadnikova et al., 2013 (C) "]
[141,2,"Li et al., 2013 (C), Pan et al., 2012 (C) "]
[221,2,"Li et al., 2013 (C), Pan et al., 2012 (C) "]
["196b",1,"Campos et al., 2014 (C)"]
["376c",1,"Fu et al., 2013 (C)"]
["517-5p",1,"Hromadnikova et al., 2015a (C)"]
["519a",1,"Hromadnikova et al., 2015a (C)"]
["524-5p",1,"Hromadnikova et al., 2015a (C)"]
["516-5p",1,"Hromadnikova et al., 2013 (C)"]
["517*",1,"Hromadnikova et al., 2013 (C)"]
["520a*",1,"Hromadnikova et al., 2013 (C)"]
["29a",1,"Li et al., 2013 (C)"]
[144,1,"Li et al., 2013 (C)"]
[1323,1,"Miura et al., 2015 (C)"]
["516b",1,"Miura et al., 2015 (C)"]
["516a-5p",1,"Miura et al., 2015 (C)"]
["525-5p",1,"Miura et al., 2015 (C)"]
["519d",1,"Miura et al., 2015 (C)"]
["526b",1,"Miura et al., 2015 (C)"]
["296-3p",1,"Murphy et al., 2015 (C)"]
["181a-5p",1,"Murphy et al., 2015 (C)"]
[98,1,"Murphy et al., 2015 (C)"]
[222,1,"Murphy et al., 2015 (C)"]
[155,1,"Murphy et al., 2015 (C)"]
[296,1,"Murphy et al., 2015 (C)"]
["181a",1,"Murphy et al., 2015 (C)"]
["29b",1,"Murphy et al., 2015 (C)"]
[149,1,"Pan et al., 2012 (C)"]
[1229,1,"Winger et al., 2015 (C)"]
[1267,1,"Winger et al., 2015 (C)"]
["148a-3p",1,"Winger et al., 2015 (C)"]
[16,1,"Winger et al., 2015 (C)"]
["199b-5p",1,"Winger et al., 2015 (C)"]
[223,1,"Winger et al., 2015 (C)"]
["30e-3p",1,"Winger et al., 2015 (C)"]
["301a-3p",1,"Winger et al., 2015 (C)"]
["340-5p",1,"Winger et al., 2015 (C)"]
["424-5p",1,"Winger et al., 2015 (C)"]
["18a",1,"Xu et al., 2014 (C)"]
["19b1",1,"Xu et al., 2014 (C)"]
["92a1",1,"Xu et al., 2014 (C)"]

{"sheet":"AllExactAllMildSevere","index":11,"n_rows":223,"n_cols":4,"rows_kept":223}
["miRs","Cited","Studies (Screening & Candidate)","Found DE in this classification only?"]
["210(S)",11,"Jiang et al., 2015, Ura et al., 2014, Xu et al., 2014, Zhang et al., 2015, Zhu et al., 2009, Lalevée et al., 2014 (C), Luo et al., 2014 (C), Muralimanoharan et al., 2012 (C), Murphy et al., 2015 (C), Xu et al., 2014 (C), Zhu et al., 2009 (C)",{"$f":"isMirExclusive(A2, A$2:$A$223)","v":{"$error":"#NAME?"}}]
["518b(S)",6,"Ura et al., 2014, Xu et al., 2014, Zhu et al., 2009, Miura et al., 2015 (C), Xu et al., 2014 (C), Zhu et al., 2009 (C)",{"$f":"isMirExclusive(A3, A$2:$A$223)","v":{"$error":"#NAME?"}}]
["29b(S)",4,"Hu et al., 2009, Wang, W. et al. 2012, Zhao et al., 2014, Murphy et al., 2015 (C)",{"$f":"isMirExclusive(A4, A$2:$A$223)","v":{"$error":"#NAME?"}}]
["221(S)",4,"Li et al., 2013, Wu et al., 2012, Zhao et al., 2014, Li et al., 2013 (C)",{"$f":"isMirExclusive(A5, A$2:$A$223)","v":{"$error":"#NAME?"}}]
["19a(S)",3,"Li et al., 2013, Xu et al., 2014, Zhu et al., 2009",{"$f":"isMirExclusive(A6, A$2:$A$223)","v":{"$error":"#NAME?"}}]
["25(S)",2,"Choi et al., 2013, Ura et al., 2014",{"$f":"isMirExclusive(A7, A$2:$A$223)","v":{"$error":"#NAME?"}}]
["21(S)",2,"Choi et al., 2013, Jiang et al., 2015",{"$f":"isMirExclusive(A8, A$2:$A$223)","v":{"$error":"#NAME?"}}]
["30a(S)",2,"Wang, W. et al. 2012, Zhao et al., 2014",{"$f":"isMirExclusive(A9, A$2:$A$223)","v":{"$error":"#NAME?"}}]
["210(M)",2,"Weedon-Fekjær al., 2014, Zhu et al., 2009 (C)",{"$f":"isMirExclusive(A10, A$2:$A$223)","v":{"$error":"#NAME?"}}]
["519e*(S)",2,"Xu et al., 2014, Zhu et al., 2009",{"$f":"isMirExclusive(A11, A$2:$A$223)","v":{"$error":"#NAME?"}}]
["19b(S)",2,"Zhang et al., 2015, Zhang et al., 2015 (C)",{"$f":"isMirExclusive(A12, A$2:$A$223)","v":{"$error":"#NAME?"}}]
["518e(S)",1,"Guo et al., 2011",{"$f":"isMirExclusive(A13, A$2:$A$223)","v":{"$error":"#NAME?"}}]
["130a(M)",1,"Li et al., 2013",{"$f":"isMirExclusive(A14, A$2:$A$223)","v":{"$error":"#NAME?"}}]
["130a(S)",1,"Wu et al., 2012",{"$f":"isMirExclusive(A15, A$2:$A$223)","v":{"$error":"#NAME?"}}]
["29a(S)",1,"Guo et al., 2011",{"$f":"isMirExclusive(A16, A$2:$A$223)","v":{"$error":"#NAME?"}}]
["518e(M)",1,"Guo et al., 2011",{"$f":"isMirExclusive(A17, A$2:$A$223)","v":{"$error":"#NAME?"}}]
["29a(M)",1,"Guo et al., 2011",{"$f":"isMirExclusive(A18, A$2:$A$223)","v":{"$error":"#NAME?"}}]
["27a(S)",1,"Hu et al., 2009",{"$f":"isMirExclusive(A19, A$2:$A$223)","v":{"$error":"#NAME?"}}]
["141(S)",1,"Hu et al., 2009",{"$f":"isMirExclusive(A20, A$2:$A$223)","v":{"$error":"#NAME?"}}]
["451(S)",1,"Hu et al., 2009",{"$f":"isMirExclusive(A21, A$2:$A$223)","v":{"$error":"#NAME?"}}]
["30a(M)",1,"Li et al., 2013",{"$f":"isMirExclusive(A22, A$2:$A$223)","v":{"$error":"#NAME?"}}]
["27a(M)",1,"Li et al., 2013",{"$f":"isMirExclusive(A23, A$2:$A$223)","v":{"$error":"#NAME?"}}]
["24(M)",1,"Li et al., 2013",{"$f":"isMirExclusive(A24, A$2:$A$223)","v":{"$error":"#NAME?"}}]
["515-3p(M)",1,"Li et al., 2013",{"$f":"isMirExclusive(A25, A$2:$A$223)","v":{"$error":"#NAME?"}}]
["518b(M)",1,"Li et al., 2013",{"$f":"isMirExclusive(A26, A$2:$A$223)","v":{"$error":"#NAME?"}}]
["424(M)",1,"Li et al., 2013",{"$f":"isMirExclusive(A27, A$2:$A$223)","v":{"$error":"#NAME?"}}]
["100(M)",1,"Li et al., 2013",{"$f":"isMirExclusive(A28, A$2:$A$223)","v":{"$error":"#NAME?"}}]
["29b(M)",1,"Li et al., 2013",{"$f":"isMirExclusive(A29, A$2:$A$223)","v":{"$error":"#NAME?"}}]
["99a(M)",1,"Li et al., 2013",{"$f":"isMirExclusive(A30, A$2:$A$223)","v":{"$error":"#NAME?"}}]
["21(M)",1,"Li et al., 2013",{"$f":"isMirExclusive(A31, A$2:$A$223)","v":{"$error":"#NAME?"}}]
["145(M)",1,"Li et al., 2013",{"$f":"isMirExclusive(A32, A$2:$A$223)","v":{"$error":"#NAME?"}}]
["19a(M)",1,"Li et al., 2013",{"$f":"isMirExclusive(A33, A$2:$A$223)","v":{"$error":"#NAME?"}}]
["19b(M)",1,"Li et al., 2013",{"$f":"isMirExclusive(A34, A$2:$A$223)","v":{"$error":"#NAME?"}}]
["25(M)",1,"Li et al., 2013",{"$f":"isMirExclusive(A35, A$2:$A$223)","v":{"$error":"#NAME?"}}]
["451(M)",1,"Li et al., 2013",{"$f":"isMirExclusive(A36, A$2:$A$223)","v":{"$error":"#NAME?"}}]
["145(S)",1,"Wu et al., 2012",{"$f":"isMirExclusive(A37, A$2:$A$223)","v":{"$error":"#NAME?"}}]
["24(S)",1,"Wu et al., 2012",{"$f":"isMirExclusive(A38, A$2:$A$223)","v":{"$error":"#NAME?"}}]
["525*(S)",1,"Xu et al., 2014",{"$f":"isMirExclusive(A39, A$2:$A$223)","v":{"$error":"#NAME?"}}]
["515-3p(S)",1,"Xu et al., 2014",{"$f":"isMirExclusive(A40, A$2:$A$223)","v":{"$error":"#NAME?"}}]
["424(S)",1,"Zhang et al., 2015",{"$f":"isMirExclusive(A41, A$2:$A$223)","v":{"$error":"#NAME?"}}]
["100(S)",1,"Zhao et al., 2014",{"$f":"isMirExclusive(A42, A$2:$A$223)","v":{"$error":"#NAME?"}}]
["99a(S)",1,"Zhao et al., 2014",{"$f":"isMirExclusive(A43, A$2:$A$223)","v":{"$error":"#NAME?"}}]
["520h(M)",1,"Hromadnikova et al., 2015a (C)",{"$f":"isMirExclusive(A44, A$2:$A$223)","v":{"$error":"#NAME?"}}]
["520h(S)",1,"Miura et al., 2015 (C)",{"$f":"isMirExclusive(A45, A$2:$A$223)","v":{"$error":"#NAME?"}}]
["141(M)",1,"Pan et al., 2012 (C)",{"$f":"isMirExclusive(A46, A$2:$A$223)","v":{"$error":"#NAME?"}}]
["221(M)",1,"Pan et al., 2012 (C)",{"$f":"isMirExclusive(A47, A$2:$A$223)","v":{"$error":"#NAME?"}}]
["181a(S)",8,"Hu et al., 2009, Jiang et al., 2015, Wu et al., 2012, Xu et al., 2014, Zhang et al., 2015, Zhu et al., 2009, Liu et al., 2012 (C), Murphy et al., 2015 (C)",{"$f":"isMirExclusive(A48, A$2:$A$223)","v":{"$error":"#NAME?"}}]
["223(S)",5,"Choi et al., 2013, Xu et al., 2014, Zhao et al., 2014, Zhu et al., 2009, Xu et al., 2014 (C)",{"$f":"isMirExclusive(A49, A$2:$A$223)","v":{"$error":"#NAME?"}}]
["195(S)",5,"Hu et al., 2009, Xu et al., 2014, Zhu et al., 2009, Bai et al., 2012 (C), Xu et al., 2014 (C)",{"$f":"isMirExclusive(A50, A$2:$A$223)","v":{"$error":"#NAME?"}}]
["16(S)",5,"Hu et al., 2009, Wang, W. et al. 2012, Wu et al., 2012, Zhang et al., 2015, Zhao et al., 2014",{"$f":"isMirExclusive(A51, A$2:$A$223)","v":{"$error":"#NAME?"}}]
["18a(S)",5,"Li et al., 2013, Xu et al., 2014, Zhu et al., 2009, Xu et al., 2014 (C), Zhu et al., 2009 (C)",{"$f":"isMirExclusive(A52, A$2:$A$223)","v":{"$error":"#NAME?"}}]
["363(S)",5,"Xu et al., 2014, Zhang et al., 2015, Zhu et al., 2009, Zhang et al., 2015 (C), Zhu et al., 2009 (C)",{"$f":"isMirExclusive(A53, A$2:$A$223)","v":{"$error":"#NAME?"}}]
["335(S)",4,"Hu et al., 2009, Jiang et al., 2015, Ura et al., 2014, Zhang et al., 2015",{"$f":"isMirExclusive(A54, A$2:$A$223)","v":{"$error":"#NAME?"}}]
["20b(S)",4,"Hu et al., 2009, Wang, W. et al. 2012, Wang, W. et al. 2012 (C), Zhang et al., 2015 (C)",{"$f":"isMirExclusive(A55, A$2:$A$223)","v":{"$error":"#NAME?"}}]
["214(S)",4,"Hu et al., 2009, Xu et al., 2014, Zhao et al., 2014, Xu et al., 2014 (C)",{"$f":"isMirExclusive(A56, A$2:$A$223)","v":{"$error":"#NAME?"}}]
["584(S)",4,"Jiang et al., 2015, Xu et al., 2014, Zhang et al., 2015, Zhu et al., 2009",{"$f":"isMirExclusive(A57, A$2:$A$223)","v":{"$error":"#NAME?"}}]
["144(S)",4,"Li et al., 2013, Ura et al., 2014, Wu et al., 2012, Zhu et al., 2009",{"$f":"isMirExclusive(A58, A$2:$A$223)","v":{"$error":"#NAME?"}}]
["26b(S)",3,"Choi et al., 2013, Hu et al., 2009, Li et al., 2013",{"$f":"isMirExclusive(A59, A$2:$A$223)","v":{"$error":"#NAME?"}}]
["204(S)",3,"Choi et al., 2013, Ura et al., 2014, Zhu et al., 2009",{"$f":"isMirExclusive(A60, A$2:$A$223)","v":{"$error":"#NAME?"}}]
["126(S)",3,"Hu et al., 2009, Jiang et al., 2015, Ura et al., 2014",{"$f":"isMirExclusive(A61, A$2:$A$223)","v":{"$error":"#NAME?"}}]
["17(S)",3,"Jiang et al., 2015, Wang, W. et al. 2012 (C), Xu et al., 2014 (C)",{"$f":"isMirExclusive(A62, A$2:$A$223)","v":{"$error":"#NAME?"}}]
["152(S)",3,"Jiang et al., 2015, Ura et al., 2014, Zhu et al., 2009",{"$f":"isMirExclusive(A63, A$2:$A$223)","v":{"$error":"#NAME?"}}]
["182(S)",3,"Jiang et al., 2015, Li et al., 2013, Zhang et al., 2015",{"$f":"isMirExclusive(A64, A$2:$A$223)","v":{"$error":"#NAME?"}}]
["32(S)",3,"Jiang et al., 2015, Ura et al., 2014, Zhu et al., 2009",{"$f":"isMirExclusive(A65, A$2:$A$223)","v":{"$error":"#NAME?"}}]
["30a-3p(S)",3,"Xu et al., 2014, Zhu et al., 2009, Xu et al., 2014 (C)",{"$f":"isMirExclusive(A66, A$2:$A$223)","v":{"$error":"#NAME?"}}]
["638(S)",3,"Xu et al., 2014, Zhao et al., 2014, Zhu et al., 2009",{"$f":"isMirExclusive(A67, A$2:$A$223)","v":{"$error":"#NAME?"}}]
["296(S)",3,"Xu et al., 2014, Zhu et al., 2009, Murphy et al., 2015 (C)",{"$f":"isMirExclusive(A68, A$2:$A$223)","v":{"$error":"#NAME?"}}]
["218(S)",3,"Xu et al., 2014, Zhu et al., 2009, Xu et al., 2014 (C)",{"$f":"isMirExclusive(A69, A$2:$A$223)","v":{"$error":"#NAME?"}}]
["411(S)",3,"Xu et al., 2014, Zhu et al., 2009, Xu et al., 2014 (C)",{"$f":"isMirExclusive(A70, A$2:$A$223)","v":{"$error":"#NAME?"}}]
["542-3p(S)",3,"Xu et al., 2014, Zhu et al., 2009, Zhu et al., 2009 (C)",{"$f":"isMirExclusive(A71, A$2:$A$223)","v":{"$error":"#NAME?"}}]
["155(S)",3,"Li, X. et al. 2014 (C), Murphy et al., 2015 (C), Zhang et al., 2010 (C)",{"$f":"isMirExclusive(A72, A$2:$A$223)","v":{"$error":"#NAME?"}}]
["342-3p(S)",2,"Choi et al., 2013, Wu et al., 2012",{"$f":"isMirExclusive(A73, A$2:$A$223)","v":{"$error":"#NAME?"}}]
["296-5p(S)",2,"Choi et al., 2013, Ura et al., 2014",{"$f":"isMirExclusive(A74, A$2:$A$223)","v":{"$error":"#NAME?"}}]
["26a(S)",2,"Choi et al., 2013, Wu et al., 2012",{"$f":"isMirExclusive(A75, A$2:$A$223)","v":{"$error":"#NAME?"}}]
["30d(S)",2,"Guo et al., 2011, Wu et al., 2012",{"$f":"isMirExclusive(A76, A$2:$A$223)","v":{"$error":"#NAME?"}}]
["222(S)",2,"Hu et al., 2009, Murphy et al., 2015 (C)",{"$f":"isMirExclusive(A77, A$2:$A$223)","v":{"$error":"#NAME?"}}]
["377(S)",2,"Jiang et al., 2015, Zhu et al., 2009",{"$f":"isMirExclusive(A78, A$2:$A$223)","v":{"$error":"#NAME?"}}]
["101(S)",2,"Li et al., 2013, Zhu et al., 2009",{"$f":"isMirExclusive(A79, A$2:$A$223)","v":{"$error":"#NAME?"}}]
["376a(S)",2,"Ura et al., 2014, Zhao et al., 2014",{"$f":"isMirExclusive(A80, A$2:$A$223)","v":{"$error":"#NAME?"}}]
["516a-5p(S)",2,"Wang, W. et al. 2012, Miura et al., 2015 (C)",{"$f":"isMirExclusive(A81, A$2:$A$223)","v":{"$error":"#NAME?"}}]
["151-3p(S)",2,"Wang, W. et al. 2012, Wu et al., 2012",{"$f":"isMirExclusive(A82, A$2:$A$223)","v":{"$error":"#NAME?"}}]
["151(S)",2,"Xu et al., 2014, Xu et al., 2014 (C)",{"$f":"isMirExclusive(A83, A$2:$A$223)","v":{"$error":"#NAME?"}}]
["31(S)",2,"Xu et al., 2014, Zhao et al., 2014",{"$f":"isMirExclusive(A84, A$2:$A$223)","v":{"$error":"#NAME?"}}]
["17-3p(S)",2,"Xu et al., 2014, Xu et al., 2014 (C)",{"$f":"isMirExclusive(A85, A$2:$A$223)","v":{"$error":"#NAME?"}}]
["193b(S)",2,"Xu et al., 2014, Xu et al., 2014 (C)",{"$f":"isMirExclusive(A86, A$2:$A$223)","v":{"$error":"#NAME?"}}]
["524(S)",2,"Xu et al., 2014, Xu et al., 2014 (C)",{"$f":"isMirExclusive(A87, A$2:$A$223)","v":{"$error":"#NAME?"}}]
["362(S)",2,"Xu et al., 2014, Zhu et al., 2009",{"$f":"isMirExclusive(A88, A$2:$A$223)","v":{"$error":"#NAME?"}}]
["590(S)",2,"Xu et al., 2014, Zhu et al., 2009",{"$f":"isMirExclusive(A89, A$2:$A$223)","v":{"$error":"#NAME?"}}]
["379(S)",2,"Xu et al., 2014, Xu et al., 2014 (C)",{"$f":"isMirExclusive(A90, A$2:$A$223)","v":{"$error":"#NAME?"}}]
["1(S)",2,"Zhang et al., 2015, Zhu et al., 2009",{"$f":"isMirExclusive(A91, A$2:$A$223)","v":{"$error":"#NAME?"}}]
["20a(S)",2,"Zhang et al., 2015, Wang, W. et al. 2012 (C)",{"$f":"isMirExclusive(A92, A$2:$A$223)","v":{"$error":"#NAME?"}}]
["125b-1-3p(S)",2,"Zhang et al., 2015, Li, Q. et al. 2014 (C)",{"$f":"isMirExclusive(A93, A$2:$A$223)","v":{"$error":"#NAME?"}}]
["10b(S)",2,"Zhao et al., 2014, Zhu et al., 2009",{"$f":"isMirExclusive(A94, A$2:$A$223)","v":{"$error":"#NAME?"}}]
["18b(S)",2,"Zhu et al., 2009, Zhang et al., 2015 (C)",{"$f":"isMirExclusive(A95, A$2:$A$223)","v":{"$error":"#NAME?"}}]
["126*(S)",1,"Zhu et al., 2009",{"$f":"isMirExclusive(A96, A$2:$A$223)","v":{"$error":"#NAME?"}}]
["301a(S)",1,"Zhao et al., 2014",{"$f":"isMirExclusive(A97, A$2:$A$223)","v":{"$error":"#NAME?"}}]
["92b(S)",1,"Choi et al., 2013",{"$f":"isMirExclusive(A98, A$2:$A$223)","v":{"$error":"#NAME?"}}]
["197(S)",1,"Choi et al., 2013",{"$f":"isMirExclusive(A99, A$2:$A$223)","v":{"$error":"#NAME?"}}]
["296-3p(S)",1,"Choi et al., 2013",{"$f":"isMirExclusive(A100, A$2:$A$223)","v":{"$error":"#NAME?"}}]
["198(S)",1,"Choi et al., 2013",{"$f":"isMirExclusive(A101, A$2:$A$223)","v":{"$error":"#NAME?"}}]
["202(S)",1,"Choi et al., 2013",{"$f":"isMirExclusive(A102, A$2:$A$223)","v":{"$error":"#NAME?"}}]
["191(S)",1,"Choi et al., 2013",{"$f":"isMirExclusive(A103, A$2:$A$223)","v":{"$error":"#NAME?"}}]
["95(S)",1,"Choi et al., 2013",{"$f":"isMirExclusive(A104, A$2:$A$223)","v":{"$error":"#NAME?"}}]
["29c(M)",1,"Guo et al., 2011",{"$f":"isMirExclusive(A105, A$2:$A$223)","v":{"$error":"#NAME?"}}]
["7f(S)",1,"Hu et al., 2009",{"$f":"isMirExclusive(A106, A$2:$A$223)","v":{"$error":"#NAME?"}}]
["565(S)",1,"Hu et al., 2009",{"$f":"isMirExclusive(A107, A$2:$A$223)","v":{"$error":"#NAME?"}}]
["519b-3p(S)",1,"Hu et al., 2009",{"$f":"isMirExclusive(A108, A$2:$A$223)","v":{"$error":"#NAME?"}}]
["450a(S)",1,"Hu et al., 2009",{"$f":"isMirExclusive(A109, A$2:$A$223)","v":{"$error":"#NAME?"}}]
["520g(S)",1,"Hu et al., 2009",{"$f":"isMirExclusive(A110, A$2:$A$223)","v":{"$error":"#NAME?"}}]
["30e(S)",1,"Hu et al., 2009",{"$f":"isMirExclusive(A111, A$2:$A$223)","v":{"$error":"#NAME?"}}]
["522(S)",1,"Hu et al., 2009",{"$f":"isMirExclusive(A112, A$2:$A$223)","v":{"$error":"#NAME?"}}]
["486-3p(S)",1,"Hu et al., 2009",{"$f":"isMirExclusive(A113, A$2:$A$223)","v":{"$error":"#NAME?"}}]
["658(S)",1,"Hu et al., 2009",{"$f":"isMirExclusive(A114, A$2:$A$223)","v":{"$error":"#NAME?"}}]
["523-3p(S)",1,"Hu et al., 2009",{"$f":"isMirExclusive(A115, A$2:$A$223)","v":{"$error":"#NAME?"}}]
["423-5p(S)",1,"Hu et al., 2009",{"$f":"isMirExclusive(A116, A$2:$A$223)","v":{"$error":"#NAME?"}}]
["491-5p(S)",1,"Hu et al., 2009",{"$f":"isMirExclusive(A117, A$2:$A$223)","v":{"$error":"#NAME?"}}]
["612(S)",1,"Hu et al., 2009",{"$f":"isMirExclusive(A118, A$2:$A$223)","v":{"$error":"#NAME?"}}]
["508-5p(S)",1,"Hu et al., 2009",{"$f":"isMirExclusive(A119, A$2:$A$223)","v":{"$error":"#NAME?"}}]
["451a(S)",1,"Jiang et al., 2015",{"$f":"isMirExclusive(A120, A$2:$A$223)","v":{"$error":"#NAME?"}}]
["516(S)",1,"Jiang et al., 2015",{"$f":"isMirExclusive(A121, A$2:$A$223)","v":{"$error":"#NAME?"}}]
["135a(S)",1,"Jiang et al., 2015",{"$f":"isMirExclusive(A122, A$2:$A$223)","v":{"$error":"#NAME?"}}]
["96(S)",1,"Jiang et al., 2015",{"$f":"isMirExclusive(A123, A$2:$A$223)","v":{"$error":"#NAME?"}}]
["196(S)",1,"Jiang et al., 2015",{"$f":"isMirExclusive(A124, A$2:$A$223)","v":{"$error":"#NAME?"}}]
["362-3p(S)",1,"Jiang et al., 2015",{"$f":"isMirExclusive(A125, A$2:$A$223)","v":{"$error":"#NAME?"}}]
["10a(S)",1,"Li et al., 2013",{"$f":"isMirExclusive(A126, A$2:$A$223)","v":{"$error":"#NAME?"}}]
["378(S)",1,"Li et al., 2013",{"$f":"isMirExclusive(A127, A$2:$A$223)","v":{"$error":"#NAME?"}}]
["144*(S)",1,"Li et al., 2013",{"$f":"isMirExclusive(A128, A$2:$A$223)","v":{"$error":"#NAME?"}}]
["15b*(S)",1,"Li et al., 2013",{"$f":"isMirExclusive(A129, A$2:$A$223)","v":{"$error":"#NAME?"}}]
["518c(M)",1,"Li et al., 2013",{"$f":"isMirExclusive(A130, A$2:$A$223)","v":{"$error":"#NAME?"}}]
["519e(M)",1,"Li et al., 2013",{"$f":"isMirExclusive(A131, A$2:$A$223)","v":{"$error":"#NAME?"}}]
["299a-5p(M)",1,"Li et al., 2013",{"$f":"isMirExclusive(A132, A$2:$A$223)","v":{"$error":"#NAME?"}}]
["23a(M)",1,"Li et al., 2013",{"$f":"isMirExclusive(A133, A$2:$A$223)","v":{"$error":"#NAME?"}}]
["23b(M)",1,"Li et al., 2013",{"$f":"isMirExclusive(A134, A$2:$A$223)","v":{"$error":"#NAME?"}}]
["34a(M)",1,"Li et al., 2013",{"$f":"isMirExclusive(A135, A$2:$A$223)","v":{"$error":"#NAME?"}}]
["525-3p(M)",1,"Li et al., 2013",{"$f":"isMirExclusive(A136, A$2:$A$223)","v":{"$error":"#NAME?"}}]
["199a-5p(M)",1,"Li et al., 2013",{"$f":"isMirExclusive(A137, A$2:$A$223)","v":{"$error":"#NAME?"}}]
["512-5p(M)",1,"Li et al., 2013",{"$f":"isMirExclusive(A138, A$2:$A$223)","v":{"$error":"#NAME?"}}]
["30b(M)",1,"Li et al., 2013",{"$f":"isMirExclusive(A139, A$2:$A$223)","v":{"$error":"#NAME?"}}]
["320c(S)",1,"Li et al., 2013",{"$f":"isMirExclusive(A140, A$2:$A$223)","v":{"$error":"#NAME?"}}]
["185(S)",1,"Li et al., 2013",{"$f":"isMirExclusive(A141, A$2:$A$223)","v":{"$error":"#NAME?"}}]
["107(S)",1,"Li et al., 2013",{"$f":"isMirExclusive(A142, A$2:$A$223)","v":{"$error":"#NAME?"}}]
["let-7b(S)",1,"Noack et al., 2011",{"$f":"isMirExclusive(A143, A$2:$A$223)","v":{"$error":"#NAME?"}}]
["302*(S)",1,"Noack et al., 2011",{"$f":"isMirExclusive(A144, A$2:$A$223)","v":{"$error":"#NAME?"}}]
["104(S)",1,"Noack et al., 2011",{"$f":"isMirExclusive(A145, A$2:$A$223)","v":{"$error":"#NAME?"}}]
["128a(S)",1,"Noack et al., 2011",{"$f":"isMirExclusive(A146, A$2:$A$223)","v":{"$error":"#NAME?"}}]
["182*(S)",1,"Noack et al., 2011",{"$f":"isMirExclusive(A147, A$2:$A$223)","v":{"$error":"#NAME?"}}]
["133b(S)",1,"Noack et al., 2011",{"$f":"isMirExclusive(A148, A$2:$A$223)","v":{"$error":"#NAME?"}}]
["1233(S)",1,"Ura et al., 2014",{"$f":"isMirExclusive(A149, A$2:$A$223)","v":{"$error":"#NAME?"}}]
["650(S)",1,"Ura et al., 2014",{"$f":"isMirExclusive(A150, A$2:$A$223)","v":{"$error":"#NAME?"}}]
["520a(S)",1,"Ura et al., 2014",{"$f":"isMirExclusive(A151, A$2:$A$223)","v":{"$error":"#NAME?"}}]
["215(S)",1,"Ura et al., 2014",{"$f":"isMirExclusive(A152, A$2:$A$223)","v":{"$error":"#NAME?"}}]
["193a-3p(S)",1,"Ura et al., 2014",{"$f":"isMirExclusive(A153, A$2:$A$223)","v":{"$error":"#NAME?"}}]
["668(S)",1,"Ura et al., 2014",{"$f":"isMirExclusive(A154, A$2:$A$223)","v":{"$error":"#NAME?"}}]
["15b(S)",1,"Ura et al., 2014",{"$f":"isMirExclusive(A155, A$2:$A$223)","v":{"$error":"#NAME?"}}]
["512-3p(S)",1,"Wang, W. et al. 2012",{"$f":"isMirExclusive(A156, A$2:$A$223)","v":{"$error":"#NAME?"}}]
["2277(S)",1,"Wang, W. et al. 2012",{"$f":"isMirExclusive(A157, A$2:$A$223)","v":{"$error":"#NAME?"}}]
["524-3p(S)",1,"Wang, W. et al. 2012",{"$f":"isMirExclusive(A158, A$2:$A$223)","v":{"$error":"#NAME?"}}]
["146a(S)",1,"Wang, W. et al. 2012",{"$f":"isMirExclusive(A159, A$2:$A$223)","v":{"$error":"#NAME?"}}]
["192(S)",1,"Wang, W. et al. 2012",{"$f":"isMirExclusive(A160, A$2:$A$223)","v":{"$error":"#NAME?"}}]
["34c-5p(S)",1,"Wang, W. et al. 2012",{"$f":"isMirExclusive(A161, A$2:$A$223)","v":{"$error":"#NAME?"}}]
["1301(S)",1,"Weedon-Fekjær al., 2014",{"$f":"isMirExclusive(A162, A$2:$A$223)","v":{"$error":"#NAME?"}}]
["223-3p(S)",1,"Weedon-Fekjær al., 2014",{"$f":"isMirExclusive(A163, A$2:$A$223)","v":{"$error":"#NAME?"}}]
["224-5p(S)",1,"Weedon-Fekjær al., 2014",{"$f":"isMirExclusive(A164, A$2:$A$223)","v":{"$error":"#NAME?"}}]
["574-5p(S)",1,"Wu et al., 2012",{"$f":"isMirExclusive(A165, A$2:$A$223)","v":{"$error":"#NAME?"}}]
["130b(S)",1,"Wu et al., 2012",{"$f":"isMirExclusive(A166, A$2:$A$223)","v":{"$error":"#NAME?"}}]
["103(S)",1,"Wu et al., 2012",{"$f":"isMirExclusive(A167, A$2:$A$223)","v":{"$error":"#NAME?"}}]
["425(S)",1,"Wu et al., 2012",{"$f":"isMirExclusive(A168, A$2:$A$223)","v":{"$error":"#NAME?"}}]
["355(S)",1,"Zhang et al., 2015",{"$f":"isMirExclusive(A169, A$2:$A$223)","v":{"$error":"#NAME?"}}]
["1469(S)",1,"Zhang et al., 2015",{"$f":"isMirExclusive(A170, A$2:$A$223)","v":{"$error":"#NAME?"}}]
["29a-3p(S)",1,"Zhang et al., 2015",{"$f":"isMirExclusive(A171, A$2:$A$223)","v":{"$error":"#NAME?"}}]
["200c(S)",1,"Zhang et al., 2015",{"$f":"isMirExclusive(A172, A$2:$A$223)","v":{"$error":"#NAME?"}}]
["744(S)",1,"Zhang et al., 2015",{"$f":"isMirExclusive(A173, A$2:$A$223)","v":{"$error":"#NAME?"}}]
["1826(S)",1,"Zhang et al., 2015",{"$f":"isMirExclusive(A174, A$2:$A$223)","v":{"$error":"#NAME?"}}]
["136(S)",1,"Zhao et al., 2014",{"$f":"isMirExclusive(A175, A$2:$A$223)","v":{"$error":"#NAME?"}}]
["140-3p(S)",1,"Zhao et al., 2014",{"$f":"isMirExclusive(A176, A$2:$A$223)","v":{"$error":"#NAME?"}}]
["494(S)",1,"Zhao et al., 2014",{"$f":"isMirExclusive(A177, A$2:$A$223)","v":{"$error":"#NAME?"}}]
["376c(S)",1,"Zhao et al., 2014",{"$f":"isMirExclusive(A178, A$2:$A$223)","v":{"$error":"#NAME?"}}]
["4324(S)",1,"Zhao et al., 2014",{"$f":"isMirExclusive(A179, A$2:$A$223)","v":{"$error":"#NAME?"}}]
["324-5p(S)",1,"Zhao et al., 2014",{"$f":"isMirExclusive(A180, A$2:$A$223)","v":{"$error":"#NAME?"}}]
["140-5p(S)",1,"Zhao et al., 2014",{"$f":"isMirExclusive(A181, A$2:$A$223)","v":{"$error":"#NAME?"}}]
["127-3p(S)",1,"Zhao et al., 2014",{"$f":"isMirExclusive(A182, A$2:$A$223)","v":{"$error":"#NAME?"}}]
["590-5p(S)",1,"Zhao et al., 2014",{"$f":"isMirExclusive(A183, A$2:$A$223)","v":{"$error":"#NAME?"}}]
["495(S)",1,"Zhao et al., 2014",{"$f":"isMirExclusive(A184, A$2:$A$223)","v":{"$error":"#NAME?"}}]
["148a(S)",1,"Zhao et al., 2014",{"$f":"isMirExclusive(A185, A$2:$A$223)","v":{"$error":"#NAME?"}}]
["4270(S)",1,"Zhao et al., 2014",{"$f":"isMirExclusive(A186, A$2:$A$223)","v":{"$error":"#NAME?"}}]
["1225-5p(S)",1,"Zhao et al., 2014",{"$f":"isMirExclusive(A187, A$2:$A$223)","v":{"$error":"#NAME?"}}]
["1207(S)",1,"Zhao et al., 2014",{"$f":"isMirExclusive(A188, A$2:$A$223)","v":{"$error":"#NAME?"}}]
["1202(S)",1,"Zhao et al., 2014",{"$f":"isMirExclusive(A189, A$2:$A$223)","v":{"$error":"#NAME?"}}]
["2861(S)",1,"Zhao et al., 2014",{"$f":"isMirExclusive(A190, A$2:$A$223)","v":{"$error":"#NAME?"}}]
["483-5p(S)",1,"Zhao et al., 2014",{"$f":"isMirExclusive(A191, A$2:$A$223)","v":{"$error":"#NAME?"}}]
["575(S)",1,"Zhao et al., 2014",{"$f":"isMirExclusive(A192, A$2:$A$223)","v":{"$error":"#NAME?"}}]
["4327(S)",1,"Zhao et al., 2014",{"$f":"isMirExclusive(A193, A$2:$A$223)","v":{"$error":"#NAME?"}}]
["4298(S)",1,"Zhao et al., 2014",{"$f":"isMirExclusive(A194, A$2:$A$223)","v":{"$error":"#NAME?"}}]
["3679-5p(S)",1,"Zhao et al., 2014",{"$f":"isMirExclusive(A195, A$2:$A$223)","v":{"$error":"#NAME?"}}]
["1915(S)",1,"Zhao et al., 2014",{"$f":"isMirExclusive(A196, A$2:$A$223)","v":{"$error":"#NAME?"}}]
["132(S)",1,"Zhao et al., 2014",{"$f":"isMirExclusive(A197, A$2:$A$223)","v":{"$error":"#NAME?"}}]
["199b-5p(S)",1,"Zhao et al., 2014",{"$f":"isMirExclusive(A198, A$2:$A$223)","v":{"$error":"#NAME?"}}]
["4281(S)",1,"Zhao et al., 2014",{"$f":"isMirExclusive(A199, A$2:$A$223)","v":{"$error":"#NAME?"}}]
["517*(S)",1,"Zhu et al., 2009",{"$f":"isMirExclusive(A200, A$2:$A$223)","v":{"$error":"#NAME?"}}]
["154*(S)",1,"Zhu et al., 2009",{"$f":"isMirExclusive(A201, A$2:$A$223)","v":{"$error":"#NAME?"}}]
["625(S)",1,"Zhu et al., 2009",{"$f":"isMirExclusive(A202, A$2:$A$223)","v":{"$error":"#NAME?"}}]
["150(S)",1,"Zhu et al., 2009",{"$f":"isMirExclusive(A203, A$2:$A$223)","v":{"$error":"#NAME?"}}]
["450(S)",1,"Zhu et al., 2009",{"$f":"isMirExclusive(A204, A$2:$A$223)","v":{"$error":"#NAME?"}}]
["374(S)",1,"Zhu et al., 2009",{"$f":"isMirExclusive(A205, A$2:$A$223)","v":{"$error":"#NAME?"}}]
["675(S)",1,"Gao et al., 2012 (C)",{"$f":"isMirExclusive(A206, A$2:$A$223)","v":{"$error":"#NAME?"}}]
["519a(S)",1,"Hromadnikova et al., 2015a (C)",{"$f":"isMirExclusive(A207, A$2:$A$223)","v":{"$error":"#NAME?"}}]
["455-3P(S)",1,"Lalevée et al., 2014 (C)",{"$f":"isMirExclusive(A208, A$2:$A$223)","v":{"$error":"#NAME?"}}]
["455-5P(S)",1,"Lalevée et al., 2014 (C)",{"$f":"isMirExclusive(A209, A$2:$A$223)","v":{"$error":"#NAME?"}}]
["1323(S)",1,"Miura et al., 2015 (C)",{"$f":"isMirExclusive(A210, A$2:$A$223)","v":{"$error":"#NAME?"}}]
["516b(S)",1,"Miura et al., 2015 (C)",{"$f":"isMirExclusive(A211, A$2:$A$223)","v":{"$error":"#NAME?"}}]
["525-5p(S)",1,"Miura et al., 2015 (C)",{"$f":"isMirExclusive(A212, A$2:$A$223)","v":{"$error":"#NAME?"}}]
["515-5p(S)",1,"Miura et al., 2015 (C)",{"$f":"isMirExclusive(A213, A$2:$A$223)","v":{"$error":"#NAME?"}}]
["520a-5p(S)",1,"Miura et al., 2015 (C)",{"$f":"isMirExclusive(A214, A$2:$A$223)","v":{"$error":"#NAME?"}}]
["519d(S)",1,"Miura et al., 2015 (C)",{"$f":"isMirExclusive(A215, A$2:$A$223)","v":{"$error":"#NAME?"}}]
["526b(S)",1,"Miura et al., 2015 (C)",{"$f":"isMirExclusive(A216, A$2:$A$223)","v":{"$error":"#NAME?"}}]
["98(S)",1,"Murphy et al., 2015 (C)",{"$f":"isMirExclusive(A217, A$2:$A$223)","v":{"$error":"#NAME?"}}]
["149(M)",1,"Pan et al., 2012 (C)",{"$f":"isMirExclusive(A218, A$2:$A$223)","v":{"$error":"#NAME?"}}]
["519e-5p(S)",1,"Xu et al., 2014 (C)",{"$f":"isMirExclusive(A219, A$2:$A$223)","v":{"$error":"#NAME?"}}]
["19b1(S)",1,"Xu et al., 2014 (C)",{"$f":"isMirExclusive(A220, A$2:$A$223)","v":{"$error":"#NAME?"}}]
["92a1(S)",1,"Xu et al., 2014 (C)",{"$f":"isMirExclusive(A221, A$2:$A$223)","v":{"$error":"#NAME?"}}]
["106a(S)",1,"Zhang et al., 2015 (C)",{"$f":"isMirExclusive(A222, A$2:$A$223)","v":{"$error":"#NAME?"}}]
["92a(S)",1,"Zhang et al., 2015 (C)",{"$f":"isMirExclusive(A223, A$2:$A$223)","v":{"$error":"#NAME?"}}]

{"sheet":"Studies","index":12,"n_rows":24,"n_cols":18,"rows_kept":24}
["Sample Type","Screening","Candidate",null,"Cohort size","Num. of studies (s)",null,"Extraction","Num. of studies (s)",null,null,"Internal controls for qPCR","Studies",null,"Profiling","Num of studies (s)",null,"Hypoxia-regulated miRs detected in [Kulshreshtha et al., 2007]"]
["Placenta",17,28,null,"<10",17,null,"Kit (miRNEasy Mini)",1,null,null,"5S",3,null,"Microarray",14,null,"hsa-miR-21"]
["Plasma",4,11,null,"10-20",3,null,"Kit (mirVana Isolation)",8,null,null,"cel-miR-238",1,null,"Panel-based qPCR",4,null,"hsa-miR-23a"]
["Serum",2,1,null,"20-30",3,null,"Kit (RecoverAll)",1,null,null,"cel-miR-39",7,null,"NGS",6,null,"hsa-miR-23b"]
["Mesenchymal Stem Cells",2,1,null,">30",1,null,"Kit (mirVana PARIS)",2,null,null,"cel-miR-54",1,{"$nulls":4},"hsa-miR-24-1"]
["Endothelial Progenitor Cells",0,1,{"$nulls":4},"GTPC-only",9,null,null,"hsa-miRNA-525-5p",1,{"$nulls":4},"hsa-miR-26b"]
["Peripheral blood mononuclear cells ",0,1,{"$nulls":4},"GTPC + Kit (mirVana Isolation)",3,null,null,"JMP9",1,{"$nulls":4},"hsa-miR-27a"]
[{"$nulls":11},"RNU44",1,{"$nulls":4},"hsa-miR-30b"]
[{"$nulls":11},"RNU48",1,{"$nulls":4},"hsa-miR-93-1"]
[{"$nulls":11},"RNU54",1,{"$nulls":4},"hsa-miR-103-2"]
[{"$nulls":11},"RNU58A ",1,{"$nulls":4},"hsa-miR-103-1"]
[{"$nulls":11},"RNU6B",2,{"$nulls":4},"hsa-miR-106a"]
[{"$nulls":11},"SNORD25",1,{"$nulls":4},"hsa-miR-125b-1"]
[{"$nulls":11},"snoRNA202",1,{"$nulls":4},"hsa-miR-181a-2"]
[{"$nulls":11},"U18",2,{"$nulls":4},"hsa-miR-181c"]
[{"$nulls":11},"U25",1,{"$nulls":4},"hsa-miR-195"]
[{"$nulls":11},"U6",30,{"$nulls":4},"hsa-miR-210"]
[{"$nulls":17},"hsa-miR-213-5p"]
[{"$nulls":17},"hsa-miR-26a"]
[{"$nulls":17},"hsa-miR-181b-1"]
[{"$nulls":17},"hsa-miR-26a-1"]
[{"$nulls":17},"hsa-miR-192"]
[{"$nulls":17},"hsa-miR-107"]
[{"$nulls":17},"hsa-miR-181b-1"]