{"text_format":"3","workbook":"xlsx","n_sheets":13,"sheets":["ScreenExactAllAll","ScreenBaseAllAll","ScreenArmlesssAllAll","ScreenExactPlacentaAll","ScreenExactCirculationAll","ScreeningValidatedAllAll","CandidateExactAllAll","CandidateExactChorionicBasalAll","AllValidatedAllAll","AllExactPlacentaAll","AllExactCirculationAll","AllExactAllMildSevere","Studies"],"not_rendered":{"charts":8,"images":1,"macros":1},"read":"whole","date_system":"1900"}

{"sheet":"ScreenExactAllAll","index":0,"n_rows":242,"n_cols":6,"rows_kept":242}
["microRNA","Validated?","Candidate?","Cited","Valided Targets","Studies"]
[223,{"$f":"IF(ISERROR(VLOOKUP(A2,AllValidatedAllAll!$A$2:$A$115, 1, FALSE)),\"No\",\"Yes\")","v":"Yes"},{"$f":"IF(ISERROR(VLOOKUP(A2,CandidateExactAllAll!$A$2:$A$84, 1, FALSE)),\"No\",\"Yes\")","v":"Yes"},9,"GZMB, STAT3, E2F1, FOXO1","Betoni et al., 2013, Choi et al., 2013, Guo et al., 2011, Li et al., 2013, Mayor-Lynn et al., 2011, Xu et al., 2014, Yang et al., 2011, Zhao et al., 2014, Zhu et al., 2009"]
[210,{"$f":"IF(ISERROR(VLOOKUP(A3,AllValidatedAllAll!$A$2:$A$115, 1, FALSE)),\"No\",\"Yes\")","v":"Yes"},{"$f":"IF(ISERROR(VLOOKUP(A3,CandidateExactAllAll!$A$2:$A$84, 1, FALSE)),\"No\",\"Yes\")","v":"Yes"},9,"HSD17B1, ISCU, EFNA3, HOXA9","Enquobahrie et al., 2011, Ishibashi et al., 2012, Jiang et al., 2015, Pineles et al., 2007, Ura et al., 2014, Weedon-Fekjær al., 2014, Xu et al., 2014, Zhang et al., 2015, Zhu et al., 2009"]
["518b",{"$f":"IF(ISERROR(VLOOKUP(A4,AllValidatedAllAll!$A$2:$A$115, 1, FALSE)),\"No\",\"Yes\")","v":"Yes"},{"$f":"IF(ISERROR(VLOOKUP(A4,CandidateExactAllAll!$A$2:$A$84, 1, FALSE)),\"No\",\"Yes\")","v":"Yes"},6,"RAP1B, FOXN1","Guo et al., 2011, Li et al., 2013, Mayor-Lynn et al., 2011, Ura et al., 2014, Xu et al., 2014, Zhu et al., 2009"]
["181a",{"$f":"IF(ISERROR(VLOOKUP(A5,AllValidatedAllAll!$A$2:$A$115, 1, FALSE)),\"No\",\"Yes\")","v":"Yes"},{"$f":"IF(ISERROR(VLOOKUP(A5,CandidateExactAllAll!$A$2:$A$84, 1, FALSE)),\"No\",\"Yes\")","v":"Yes"},6,"(5p) BIRC6, (3p) CBX5","Hu et al., 2009, Jiang et al., 2015, Wu et al., 2012, Xu et al., 2014, Zhang et al., 2015, Zhu et al., 2009"]
[584,{"$f":"IF(ISERROR(VLOOKUP(A6,AllValidatedAllAll!$A$2:$A$115, 1, FALSE)),\"No\",\"Yes\")","v":"Yes"},{"$f":"IF(ISERROR(VLOOKUP(A6,CandidateExactAllAll!$A$2:$A$84, 1, FALSE)),\"No\",\"Yes\")","v":"No"},5,"(5p) KPNB1, PURB, CUL2","Enquobahrie et al., 2011, Jiang et al., 2015, Xu et al., 2014, Zhang et al., 2015, Zhu et al., 2009"]
["517c",{"$f":"IF(ISERROR(VLOOKUP(A7,AllValidatedAllAll!$A$2:$A$115, 1, FALSE)),\"No\",\"Yes\")","v":"Yes"},{"$f":"IF(ISERROR(VLOOKUP(A7,CandidateExactAllAll!$A$2:$A$84, 1, FALSE)),\"No\",\"Yes\")","v":"Yes"},5,"Pyk2, (3p) NFIB","Guo et al., 2011, Ishibashi et al., 2012, Li et al., 2013, Yang et al., 2011, Yang et al., 2015"]
[16,{"$f":"IF(ISERROR(VLOOKUP(A8,AllValidatedAllAll!$A$2:$A$115, 1, FALSE)),\"No\",\"Yes\")","v":"Yes"},{"$f":"IF(ISERROR(VLOOKUP(A8,CandidateExactAllAll!$A$2:$A$84, 1, FALSE)),\"No\",\"Yes\")","v":"Yes"},5,"BLC-2, CCNE1","Hu et al., 2009, Wang, Y. et al. 2012, Wu et al., 2012, Zhang et al., 2015, Zhao et al., 2014"]
["18a",{"$f":"IF(ISERROR(VLOOKUP(A9,AllValidatedAllAll!$A$2:$A$115, 1, FALSE)),\"No\",\"Yes\")","v":"Yes"},{"$f":"IF(ISERROR(VLOOKUP(A9,CandidateExactAllAll!$A$2:$A$84, 1, FALSE)),\"No\",\"Yes\")","v":"Yes"},5," TAOK2, (3p) SRF (5p) INADL ","Ishibashi et al., 2012, Li et al., 2013, Xu et al., 2014, Yang et al., 2015, Zhu et al., 2009"]
[363,{"$f":"IF(ISERROR(VLOOKUP(A10,AllValidatedAllAll!$A$2:$A$115, 1, FALSE)),\"No\",\"Yes\")","v":"Yes"},{"$f":"IF(ISERROR(VLOOKUP(A10,CandidateExactAllAll!$A$2:$A$84, 1, FALSE)),\"No\",\"Yes\")","v":"Yes"},4,"(3p) CDKN1A","Betoni et al., 2013, Xu et al., 2014, Zhang et al., 2015, Zhu et al., 2009"]
{"$rows_left_out":233}
{"sheet":"ScreenBaseAllAll","index":1,"n_rows":170,"n_cols":3,"rows_kept":170}
["microRNA","Cited","Studies (specific miRs discovered by study)"]
[518,14,"Guo et al., 2011 <518e,518b,518e> Ishibashi et al., 2012 <518f,518c> Li et al., 2013 <518c,518b> Mayor-Lynn et al., 2011 <518b> Ura et al., 2014 <518b> Xu et al., 2014 <518b> Yang et al., 2011 <518e> Yang et al., 2015 <518-3p,518e> Zhu et al., 2009 <518b>"]
[29,12,"Guo et al., 2011 <29a,29a,29c> Hu et al., 2009 <29b> Li et al., 2013 <29a,29c,29b> Wang, Y. et al. 2012 <29b> Yang et al., 2011 <29a> Yang et al., 2015 <29a> Zhang et al., 2015 <29a-3p> Zhao et al., 2014 <29b>"]
[223,10,"Betoni et al., 2013 <223> Choi et al., 2013 <223> Guo et al., 2011 <223> Li et al., 2013 <223> Mayor-Lynn et al., 2011 <223> Weedon-Fekjær al., 2014 <223-3p> Xu et al., 2014 <223> Yang et al., 2011 <223> Zhao et al., 2014 <223> Zhu et al., 2009 <223>"]
[517,10,"Guo et al., 2011 <517a,517c> Ishibashi et al., 2012 <517c> Li et al., 2013 <517b,517c> Mayor-Lynn et al., 2011 <517a> Yang et al., 2011 <517c,517b> Yang et al., 2015 <517c> Zhu et al., 2009 <517*>"]
[30,10,"Guo et al., 2011 <30d> Hu et al., 2009 <30e> Li et al., 2013 <30a,30b> Mayor-Lynn et al., 2011 <30d> Wang, Y. et al. 2012 <30a> Wu et al., 2012 <30d> Xu et al., 2014 <30a-3p> Zhao et al., 2014 <30a> Zhu et al., 2009 <30a-3p>"]
[519,10,"Hu et al., 2009 <519b-3p> Ishibashi et al., 2012 <519e*> Li et al., 2013 <519d,519a,519e> Xu et al., 2014 <519e*> Yang et al., 2011 <519d,519a> Yang et al., 2015 <519d> Zhu et al., 2009 <519e*>"]
[210,9,"Enquobahrie et al., 2011 <210> Ishibashi et al., 2012 <210> Jiang et al., 2015 <210> Pineles et al., 2007 <210> Ura et al., 2014 <210> Weedon-Fekjær al., 2014 <210> Xu et al., 2014 <210> Zhang et al., 2015 <210> Zhu et al., 2009 <210>"]
[520,8,"Betoni et al., 2013 <520f,520c-3p> Hu et al., 2009 <520g> Ishibashi et al., 2012 <520a-3p> Li et al., 2013 <520h> Ura et al., 2014 <520a> Yang et al., 2011 <520h,520g>"]
[126,8,"Guo et al., 2011 <126*> Hu et al., 2009 <126> Ishibashi et al., 2012 <126*> Jiang et al., 2015 <126> Ura et al., 2014 <126> Yang et al., 2015 <126,126*> Zhu et al., 2009 <126*>"]
{"$rows_left_out":161}
{"sheet":"ScreenArmlesssAllAll","index":2,"n_rows":215,"n_cols":3,"rows_kept":215}
["microRNA","Cited","Studies"]
[223,10,"Betoni et al., 2013, Choi et al., 2013, Guo et al., 2011, Li et al., 2013, Mayor-Lynn et al., 2011, Weedon-Fekjær al., 2014, Xu et al., 2014, Yang et al., 2011, Zhao et al., 2014, Zhu et al., 2009"]
[210,9,"Enquobahrie et al., 2011, Ishibashi et al., 2012, Jiang et al., 2015, Pineles et al., 2007, Ura et al., 2014, Weedon-Fekjær al., 2014, Xu et al., 2014, Zhang et al., 2015, Zhu et al., 2009"]
[126,7,"Guo et al., 2011, Hu et al., 2009, Ishibashi et al., 2012, Jiang et al., 2015, Ura et al., 2014, Yang et al., 2015, Zhu et al., 2009"]
["518b",6,"Guo et al., 2011, Li et al., 2013, Mayor-Lynn et al., 2011, Ura et al., 2014, Xu et al., 2014, Zhu et al., 2009"]
["181a",6,"Hu et al., 2009, Jiang et al., 2015, Wu et al., 2012, Xu et al., 2014, Zhang et al., 2015, Zhu et al., 2009"]
[584,5,"Enquobahrie et al., 2011, Jiang et al., 2015, Xu et al., 2014, Zhang et al., 2015, Zhu et al., 2009"]
["29a",5,"Guo et al., 2011, Li et al., 2013, Yang et al., 2011, Yang et al., 2015, Zhang et al., 2015"]
["517c",5,"Guo et al., 2011, Ishibashi et al., 2012, Li et al., 2013, Yang et al., 2011, Yang et al., 2015"]
[16,5,"Hu et al., 2009, Wang, Y. et al. 2012, Wu et al., 2012, Zhang et al., 2015, Zhao et al., 2014"]
{"$rows_left_out":206}
{"sheet":"ScreenExactPlacentaAll","index":3,"n_rows":173,"n_cols":4,"rows_kept":173}
["microRNA","In Circulation?","Cited","Studies"]
[210,{"$f":"IF(ISERROR(VLOOKUP(A2,AllExactCirculationAll!$A$2:$A$152, 1, FALSE)),\"No\",\"Yes\")","v":"Yes"},8,"Enquobahrie et al., 2011, Ishibashi et al., 2012, Jiang et al., 2015, Pineles et al., 2007, Weedon-Fekjær al., 2014, Xu et al., 2014, Zhang et al., 2015, Zhu et al., 2009"]
[223,{"$f":"IF(ISERROR(VLOOKUP(A3,AllExactCirculationAll!$A$2:$A$152, 1, FALSE)),\"No\",\"Yes\")","v":"Yes"},6,"Betoni et al., 2013, Choi et al., 2013, Guo et al., 2011, Mayor-Lynn et al., 2011, Xu et al., 2014, Zhu et al., 2009"]
["181a",{"$f":"IF(ISERROR(VLOOKUP(A4,AllExactCirculationAll!$A$2:$A$152, 1, FALSE)),\"No\",\"Yes\")","v":"Yes"},5,"Hu et al., 2009, Jiang et al., 2015, Xu et al., 2014, Zhang et al., 2015, Zhu et al., 2009"]
["126*",{"$f":"IF(ISERROR(VLOOKUP(A5,AllExactCirculationAll!$A$2:$A$152, 1, FALSE)),\"No\",\"Yes\")","v":"Yes"},4,"Guo et al., 2011, Ishibashi et al., 2012, Yang et al., 2015, Zhu et al., 2009"]
["518b",{"$f":"IF(ISERROR(VLOOKUP(A6,AllExactCirculationAll!$A$2:$A$152, 1, FALSE)),\"No\",\"Yes\")","v":"Yes"},4,"Guo et al., 2011, Mayor-Lynn et al., 2011, Xu et al., 2014, Zhu et al., 2009"]
["18a",{"$f":"IF(ISERROR(VLOOKUP(A7,AllExactCirculationAll!$A$2:$A$152, 1, FALSE)),\"No\",\"Yes\")","v":"Yes"},4,"Ishibashi et al., 2012, Xu et al., 2014, Yang et al., 2015, Zhu et al., 2009"]
["517c",{"$f":"IF(ISERROR(VLOOKUP(A8,AllExactCirculationAll!$A$2:$A$152, 1, FALSE)),\"No\",\"Yes\")","v":"Yes"},3,"Guo et al., 2011, Ishibashi et al., 2012, Yang et al., 2015"]
[335,{"$f":"IF(ISERROR(VLOOKUP(A9,AllExactCirculationAll!$A$2:$A$152, 1, FALSE)),\"No\",\"Yes\")","v":"Yes"},3,"Hu et al., 2009, Jiang et al., 2015, Zhang et al., 2015"]
[126,{"$f":"IF(ISERROR(VLOOKUP(A10,AllExactCirculationAll!$A$2:$A$152, 1, FALSE)),\"No\",\"Yes\")","v":"Yes"},3,"Hu et al., 2009, Jiang et al., 2015, Yang et al., 2015"]
{"$rows_left_out":164}
{"sheet":"ScreenExactCirculationAll","index":4,"n_rows":105,"n_cols":4,"rows_kept":105}
["microRNA","In Placenta?","Cited","Studies"]
["519d",{"$f":"IF(ISERROR(VLOOKUP(A2,AllExactPlacentaAll!$A$2:$A$221, 1, FALSE)),\"No\",\"Yes\")","v":"Yes"},3,"Li et al., 2013, Yang et al., 2011, Yang et al., 2015"]
["517c",{"$f":"IF(ISERROR(VLOOKUP(A3,AllExactPlacentaAll!$A$2:$A$221, 1, FALSE)),\"No\",\"Yes\")","v":"Yes"},3,"Li et al., 2013, Yang et al., 2011, Yang et al., 2015"]
["29a",{"$f":"IF(ISERROR(VLOOKUP(A4,AllExactPlacentaAll!$A$2:$A$221, 1, FALSE)),\"No\",\"Yes\")","v":"Yes"},3,"Li et al., 2013, Yang et al., 2011, Yang et al., 2015"]
[144,{"$f":"IF(ISERROR(VLOOKUP(A5,AllExactPlacentaAll!$A$2:$A$221, 1, FALSE)),\"No\",\"Yes\")","v":"Yes"},3,"Li et al., 2013, Ura et al., 2014, Wu et al., 2012"]
["130a",{"$f":"IF(ISERROR(VLOOKUP(A6,AllExactPlacentaAll!$A$2:$A$221, 1, FALSE)),\"No\",\"Yes\")","v":"Yes"},3,"Li et al., 2013, Wu et al., 2012, Yang et al., 2015"]
["18a",{"$f":"IF(ISERROR(VLOOKUP(A7,AllExactPlacentaAll!$A$2:$A$221, 1, FALSE)),\"No\",\"Yes\")","v":"Yes"},2,"Li et al., 2013, Yang et al., 2015"]
["125b",{"$f":"IF(ISERROR(VLOOKUP(A8,AllExactPlacentaAll!$A$2:$A$221, 1, FALSE)),\"No\",\"Yes\")","v":"Yes"},2,"Li et al., 2013, Yang et al., 2011"]
["27a",{"$f":"IF(ISERROR(VLOOKUP(A9,AllExactPlacentaAll!$A$2:$A$221, 1, FALSE)),\"No\",\"Yes\")","v":"Yes"},2,"Li et al., 2013, Yang et al., 2015"]
[24,{"$f":"IF(ISERROR(VLOOKUP(A10,AllExactPlacentaAll!$A$2:$A$221, 1, FALSE)),\"No\",\"Yes\")","v":"Yes"},2,"Li et al., 2013, Wu et al., 2012"]
{"$rows_left_out":96}
{"sheet":"ScreeningValidatedAllAll","index":5,"n_rows":54,"n_cols":7,"rows_kept":54}
["miR (exact)","Count","Studies",null,"miR (base)","Count","Studies (full miR name)"]
[210,4,"Enquobahrie et al., 2011, Ura et al., 2014, Xu et al., 2014, Zhu et al., 2009",null,210,4,"Enquobahrie et al., 2011 <210> Ura et al., 2014 <210> Xu et al., 2014 <210> Zhu et al., 2009 <210>"]
[16,3,"Hu et al., 2009, Wang, Y. et al. 2012, Zhao et al., 2014",null,29,4,"Hu et al., 2009 <29b> Li et al., 2013 <29a> Wang, Y. et al. 2012 <29b> Zhao et al., 2014 <29b>"]
["29b",3,"Hu et al., 2009, Wang, Y. et al. 2012, Zhao et al., 2014",null,26,3,"Choi et al., 2013 <26b> Hu et al., 2009 <26b> Wu et al., 2012 <26a>"]
["342-3p",2,"Choi et al., 2013, Wu et al., 2012",null,16,3,"Hu et al., 2009 <16> Wang, Y. et al. 2012 <16> Zhao et al., 2014 <16>"]
["26b",2,"Choi et al., 2013, Hu et al., 2009",null,30,3,"Wang, Y. et al. 2012 <30a> Xu et al., 2014 <30a-3p> Zhao et al., 2014 <30a>"]
[584,2,"Enquobahrie et al., 2011, Jiang et al., 2015",null,342,2,"Choi et al., 2013 <342-3p> Wu et al., 2012 <342-3p>"]
["181a",2,"Hu et al., 2009, Wu et al., 2012",null,296,2,"Choi et al., 2013 <296-5p,296-3p>"]
[195,2,"Hu et al., 2009, Xu et al., 2014",null,584,2,"Enquobahrie et al., 2011 <584> Jiang et al., 2015 <584>"]
[335,2,"Hu et al., 2009, Jiang et al., 2015",null,181,2,"Hu et al., 2009 <181a> Wu et al., 2012 <181a>"]
{"$rows_left_out":45}
{"sheet":"CandidateExactAllAll","index":6,"n_rows":88,"n_cols":3,"rows_kept":88}
["microRNA","Cited","Studies"]
[210,12,"Anton et al., 2013, Betoni et al., 2013, Enquobahrie et al., 2015, Gunel et al., 2011, Lalevée et al., 2014, Lee et al., 2011, Luo et al., 2014, Muralimanoharan et al., 2012, Murphy et al., 2015, Xu et al., 2014, Zhang et al., 2012, Zhu et al., 2009"]
["518b",4,"Hromadnikova et al., 2015a, Miura et al., 2015, Xu et al., 2014, Zhu et al., 2009"]
[223,3,"Enquobahrie et al., 2015, Winger et al., 2015, Xu et al., 2014"]
[155,3,"Li, X. et al. 2014, Murphy et al., 2015, Zhang et al., 2010"]
[195,2,"Bai et al., 2012, Xu et al., 2014"]
["34a",2,"Doridot et al., 2014, Sun et al., 2015"]
[126,2,"Hong et al., 2014, Yan et al., 2013"]
["515-5p",2,"Hromadnikova et al., 2015a, Miura et al., 2015"]
["520a-5p",2,"Hromadnikova et al., 2015a, Miura et al., 2015"]
{"$rows_left_out":79}
{"sheet":"CandidateExactChorionicBasalAll","index":7,"n_rows":5,"n_cols":4,"rows_kept":5}
["CHORIONIC PLATE (FETAL)","BOTH (CHORIONIC AND BASAL)","BASAL PLATE (MATERNAL)","REFERENCE"]
[null,null,"125b-1-3p","Li, Q. et al. 2014"]
[null,null,210,"Luo et al., 2014"]
["195, 18a, 379, 519e-5p, 17, 19b, 92a","223, 218, 411","210, 30a-3p, 518b, 524, 17-3p, 151, 193b, 214","Xu et al., 2014"]
["18b, 19b","20b, 92a, 363","106a","Zhang et al., 2015"]

{"sheet":"AllValidatedAllAll","index":8,"n_rows":115,"n_cols":3,"rows_kept":115}
["miR","Total","Studies"]
[210,16,"Enquobahrie et al., 2011, Ura et al., 2014, Xu et al., 2014, Zhu et al., 2009, Anton et al., 2013 (C), Betoni et al., 2013 (C), Enquobahrie et al., 2015 (C), Gunel et al., 2011 (C), Lalevée et al., 2014 (C), Lee et al., 2011 (C), Luo et al., 2014 (C), Muralimanoharan et al., 2012 (C), Murphy et al., 2015 (C), Xu et al., 2014 (C), Zhang et al., 2012 (C), Zhu et al., 2009 (C)"]
["518b",6,"Xu et al., 2014, Zhu et al., 2009, Hromadnikova et al., 2015a (C), Miura et al., 2015 (C), Xu et al., 2014 (C), Zhu et al., 2009 (C)"]
["181a",4,"Hu et al., 2009, Wu et al., 2012, Liu et al., 2012 (C), Murphy et al., 2015 (C)"]
[195,4,"Hu et al., 2009, Xu et al., 2014, Bai et al., 2012 (C), Xu et al., 2014 (C)"]
[16,4,"Hu et al., 2009, Wang, Y. et al. 2012, Zhao et al., 2014, Winger et al., 2015 (C)"]
["29b",4,"Hu et al., 2009, Wang, Y. et al. 2012, Zhao et al., 2014, Murphy et al., 2015 (C)"]
[221,4,"Li et al., 2013, Zhao et al., 2014, Li et al., 2013 (C), Pan et al., 2012 (C)"]
["18a",4,"Xu et al., 2014, Zhu et al., 2009, Xu et al., 2014 (C), Zhu et al., 2009 (C)"]
[411,4,"Xu et al., 2014, Zhu et al., 2009, Xu et al., 2014 (C), Zhu et al., 2009 (C)"]
{"$rows_left_out":106}
{"sheet":"AllExactPlacentaAll","index":9,"n_rows":221,"n_cols":3,"rows_kept":221}
["miR","Cited","Studies"]
[210,8,"Enquobahrie et al., 2011, Ishibashi et al., 2012, Jiang et al., 2015, Pineles et al., 2007, Weedon-Fekjær al., 2014, Xu et al., 2014, Zhang et al., 2015, Zhu et al., 2009"]
[223,6,"Betoni et al., 2013, Choi et al., 2013, Guo et al., 2011, Mayor-Lynn et al., 2011, Xu et al., 2014, Zhu et al., 2009"]
["181a",5,"Hu et al., 2009, Jiang et al., 2015, Xu et al., 2014, Zhang et al., 2015, Zhu et al., 2009"]
["126*",4,"Guo et al., 2011, Ishibashi et al., 2012, Yang et al., 2015, Zhu et al., 2009"]
["518b",4,"Guo et al., 2011, Mayor-Lynn et al., 2011, Xu et al., 2014, Zhu et al., 2009"]
["18a",4,"Ishibashi et al., 2012, Xu et al., 2014, Yang et al., 2015, Zhu et al., 2009"]
["517c",3,"Guo et al., 2011, Ishibashi et al., 2012, Yang et al., 2015"]
[335,3,"Hu et al., 2009, Jiang et al., 2015, Zhang et al., 2015"]
[126,3,"Hu et al., 2009, Jiang et al., 2015, Yang et al., 2015"]
{"$rows_left_out":212}
{"sheet":"AllExactCirculationAll","index":10,"n_rows":152,"n_cols":3,"rows_kept":152}
["miR","Cited","Studies"]
["519d",3,"Li et al., 2013, Yang et al., 2011, Yang et al., 2015"]
["517c",3,"Li et al., 2013, Yang et al., 2011, Yang et al., 2015"]
["29a",3,"Li et al., 2013, Yang et al., 2011, Yang et al., 2015"]
[144,3,"Li et al., 2013, Ura et al., 2014, Wu et al., 2012"]
["130a",3,"Li et al., 2013, Wu et al., 2012, Yang et al., 2015"]
["18a",2,"Li et al., 2013, Yang et al., 2015"]
["125b",2,"Li et al., 2013, Yang et al., 2011"]
["27a",2,"Li et al., 2013, Yang et al., 2015"]
[24,2,"Li et al., 2013, Wu et al., 2012"]
{"$rows_left_out":143}
{"sheet":"AllExactAllMildSevere","index":11,"n_rows":223,"n_cols":4,"rows_kept":223}
["miRs","Cited","Studies (Screening & Candidate)","Found DE in this classification only?"]
["210(S)",11,"Jiang et al., 2015, Ura et al., 2014, Xu et al., 2014, Zhang et al., 2015, Zhu et al., 2009, Lalevée et al., 2014 (C), Luo et al., 2014 (C), Muralimanoharan et al., 2012 (C), Murphy et al., 2015 (C), Xu et al., 2014 (C), Zhu et al., 2009 (C)",{"$f":"isMirExclusive(A2, A$2:$A$223)","v":{"$error":"#NAME?"}}]
["518b(S)",6,"Ura et al., 2014, Xu et al., 2014, Zhu et al., 2009, Miura et al., 2015 (C), Xu et al., 2014 (C), Zhu et al., 2009 (C)",{"$f":"isMirExclusive(A3, A$2:$A$223)","v":{"$error":"#NAME?"}}]
["29b(S)",4,"Hu et al., 2009, Wang, W. et al. 2012, Zhao et al., 2014, Murphy et al., 2015 (C)",{"$f":"isMirExclusive(A4, A$2:$A$223)","v":{"$error":"#NAME?"}}]
["221(S)",4,"Li et al., 2013, Wu et al., 2012, Zhao et al., 2014, Li et al., 2013 (C)",{"$f":"isMirExclusive(A5, A$2:$A$223)","v":{"$error":"#NAME?"}}]
["19a(S)",3,"Li et al., 2013, Xu et al., 2014, Zhu et al., 2009",{"$f":"isMirExclusive(A6, A$2:$A$223)","v":{"$error":"#NAME?"}}]
["25(S)",2,"Choi et al., 2013, Ura et al., 2014",{"$f":"isMirExclusive(A7, A$2:$A$223)","v":{"$error":"#NAME?"}}]
["21(S)",2,"Choi et al., 2013, Jiang et al., 2015",{"$f":"isMirExclusive(A8, A$2:$A$223)","v":{"$error":"#NAME?"}}]
["30a(S)",2,"Wang, W. et al. 2012, Zhao et al., 2014",{"$f":"isMirExclusive(A9, A$2:$A$223)","v":{"$error":"#NAME?"}}]
["210(M)",2,"Weedon-Fekjær al., 2014, Zhu et al., 2009 (C)",{"$f":"isMirExclusive(A10, A$2:$A$223)","v":{"$error":"#NAME?"}}]
{"$rows_left_out":214}
{"sheet":"Studies","index":12,"n_rows":24,"n_cols":18,"rows_kept":24}
["Sample Type","Screening","Candidate",null,"Cohort size","Num. of studies (s)",null,"Extraction","Num. of studies (s)",null,null,"Internal controls for qPCR","Studies",null,"Profiling","Num of studies (s)",null,"Hypoxia-regulated miRs detected in [Kulshreshtha et al., 2007]"]
["Placenta",17,28,null,"<10",17,null,"Kit (miRNEasy Mini)",1,null,null,"5S",3,null,"Microarray",14,null,"hsa-miR-21"]
["Plasma",4,11,null,"10-20",3,null,"Kit (mirVana Isolation)",8,null,null,"cel-miR-238",1,null,"Panel-based qPCR",4,null,"hsa-miR-23a"]
["Serum",2,1,null,"20-30",3,null,"Kit (RecoverAll)",1,null,null,"cel-miR-39",7,null,"NGS",6,null,"hsa-miR-23b"]
["Mesenchymal Stem Cells",2,1,null,">30",1,null,"Kit (mirVana PARIS)",2,null,null,"cel-miR-54",1,{"$nulls":4},"hsa-miR-24-1"]
["Endothelial Progenitor Cells",0,1,{"$nulls":4},"GTPC-only",9,null,null,"hsa-miRNA-525-5p",1,{"$nulls":4},"hsa-miR-26b"]
["Peripheral blood mononuclear cells ",0,1,{"$nulls":4},"GTPC + Kit (mirVana Isolation)",3,null,null,"JMP9",1,{"$nulls":4},"hsa-miR-27a"]
[{"$nulls":11},"RNU44",1,{"$nulls":4},"hsa-miR-30b"]
[{"$nulls":11},"RNU48",1,{"$nulls":4},"hsa-miR-93-1"]
[{"$nulls":11},"RNU54",1,{"$nulls":4},"hsa-miR-103-2"]
{"$rows_left_out":14}