{"text_format":"3","workbook":"xlsx","n_sheets":28,"sheets":["homepage","person","data","output","temp","var2","discriminate","discriminate2","residual","trust2","var","trust","fre","random","Chart5","工作表1","Chart6","工作表2","Chart7","工作表3","Chart8","工作表4","bubble","ANOVA2","TableA","ICC","SST","output_w"],"not_rendered":{"charts":10,"images":10,"macros":1,"external_links":1,"comments":1},"unopened":[{"sheet":"Chart5","index":14,"reason":"not_a_worksheet"},{"sheet":"Chart6","index":16,"reason":"not_a_worksheet"},{"sheet":"Chart7","index":18,"reason":"not_a_worksheet"},{"sheet":"Chart8","index":20,"reason":"not_a_worksheet"}],"read":"whole","date_system":"1900"}

{"sheet":"homepage","index":0,"n_rows":121,"n_cols":35,"rows_kept":121}
[1,null,"Continuous Rasch model",{"$nulls":6},{"$f":"ROUND(AVERAGE(var!B1:'var'!G1),2)","v":1},{"$f":"MAX(data!B2:G81)","v":80},{"$nulls":3},"Group",{"$error":"#VALUE!"},{"$error":"#VALUE!"},"Fit指標","變異數","代碼",8,"能力代碼","最大Fit指標","指標代碼",{"$f":"SUMSQ(Y2:Y81)/80","v":1.6906588928472317},null,"measure","SE",125,null,"最大最小","SE",1,"theta","SE"]
[{"$nulls":8},486," ","alpha="," "," ",57.142857142857146,{"$f":"MID(person!A2,1,1)","v":"A"},{"$f":"trust2!A2","v":1.119952169469898},{"$f":"trust2!A2","v":1.119952169469898},{"$f":"var!A2","v":0.7586785373737212},{"$f":"'var2'!A2","v":1.1041739285486694},{"$f":"person!A2","v":"A1"},{"$f":"LARGE(Q$2:Q2000,1)","v":{"v":2.376023331662253,"d":"2.38"}},{"$f":"VLOOKUP(U2,Q$2:T2000,4,FALSE)","v":"B66"},{"$f":"LARGE(R$2:R2000,1)","v":{"v":5.559985345912676,"d":"5.56"}},{"$f":"VLOOKUP(W2,R$2:T2000,3,FALSE)","v":"B59"},1.2889810599630214,null,-3.6285,6.2994,0.0518,null,{"$f":"LARGE(homepage!AA2:'homepage'!AA121,1)","v":4.0404},{"$f":"VLOOKUP(AE2,AA2:AB121,2,FALSE)","v":7.6724},{"$f":"VLOOKUP(AE2,AA2:AC121,3,FALSE)","v":1.9656},{"$f":"IF(AE2=AE3,AE2,IF(ABS((AG1-AG2+1)*AH3)+AE2>6,5.818,ABS((AG1-AG2+1)*AH3)+AE2))","v":4.854731034482755},{"$f":"IF(AF2=AF3,AF2,ABS((AG1-AG2+2)*AI3)+AF2)","v":89.29488275862026}]
[{"$nulls":9},1,1,1.7,1,null,{"$f":"MID(person!A3,1,1)","v":"A"},{"$f":"trust2!A3","v":1.3656374632439923},{"$f":"trust2!A3","v":1.3656374632439923},{"$f":"var!A3","v":0.1451791873612854},{"$f":"'var2'!A3","v":0.9715690434149813},{"$f":"person!A3","v":"A2"},{"$f":"LARGE(Q$2:Q2001,2)","v":{"v":2.2059535386245703,"d":"2.21"}},{"$f":"VLOOKUP(U3,Q$2:T2001,4,FALSE)","v":"B64"},{"$f":"LARGE(R$2:R2001,2)","v":{"v":5.185284136740546,"d":"5.19"}},{"$f":"VLOOKUP(W3,R$2:T2001,3,FALSE)","v":"B62"},1.3524381613566945,null,-2.9087,4.5153,0.1034,null,{"$f":"LARGE(homepage!AA2:'homepage'!AA121,4)","v":3.6285},{"$f":"VLOOKUP(AE3,AA2:AB121,2,FALSE)","v":6.2994},{"$f":"VLOOKUP(AE3,AA2:AC121,3,FALSE)","v":1.9482},{"$f":"IF(AE2=AE3,AE3,ABS((AE3-AE2)/(AG3-AG2)))","v":23.672413793103345},{"$f":"IF(AF2=AF3,AE3,ABS((AF3-AF2)/(AG3-AG2)))","v":78.90804597701108}]
[null,"Step:",{"$nulls":12},{"$f":"MID(person!A4,1,1)","v":"A"},{"$f":"trust2!A4","v":0.7777326865661225},{"$f":"trust2!A4","v":0.7777326865661225},{"$f":"var!A4","v":1.0185768021652521},{"$f":"'var2'!A4","v":1.2719713923275204},{"$f":"person!A4","v":"A3"},{"$f":"LARGE(Q$2:Q2002,3)","v":{"v":1.8375608516021993,"d":"1.84"}},{"$f":"VLOOKUP(U4,Q$2:T2002,4,FALSE)","v":"B60"},{"$f":"LARGE(R$2:R2002,3)","v":{"v":4.805329847607809,"d":"4.81"}},{"$f":"VLOOKUP(W4,R$2:T2002,3,FALSE)","v":"B78"},1.1508950836054221,null,-2.9087,4.5153,0.1034,null,{"$f":"SMALL(homepage!AA2:'homepage'!AA121,1)","v":-3.6285},{"$f":"VLOOKUP(AE4,AA2:AB121,2,FALSE)","v":6.2994},{"$f":"VLOOKUP(AE4,AA2:AC121,3,FALSE)","v":0.0518},{"$f":"IF(AE4=AE5,AE4,IF(AE4-(0-AG4+1)*AH5<-6,-5.818,AE4-(AG4+1)*AH5))","v":-5.818},{"$f":"IF(AF4=AF5,AF4,AF4+(0-AG4+2)*AI5)","v":73.65954767441862}]
[null,"1.Paste data onto Data sheet",{"$nulls":12},{"$f":"MID(person!A5,1,1)","v":"A"},{"$f":"trust2!A5","v":0.47590306668044857},{"$f":"trust2!A5","v":0.47590306668044857},{"$f":"var!A5","v":2.4220017918802754},{"$f":"'var2'!A5","v":1.385340907292834},{"$f":"person!A5","v":"A4"},{"$f":"LARGE(Q$2:Q2003,4)","v":{"v":1.5789050882186244,"d":"1.58"}},{"$f":"VLOOKUP(U5,Q$2:T2003,4,FALSE)","v":"B73"},{"$f":"LARGE(R$2:R2003,4)","v":{"v":4.767462049277459,"d":"4.77"}},{"$f":"VLOOKUP(W5,R$2:T2003,3,FALSE)","v":"B64"},1.0738898030473643," ",-2.9087,4.5153,0.1034,null,{"$f":"SMALL(homepage!AA2:'homepage'!AA121,2)","v":-2.9087},{"$f":"VLOOKUP(AE5,AA2:AB121,2,FALSE)","v":4.5153},{"$f":"VLOOKUP(AE5,AA2:AC121,3,FALSE)","v":0.1034},{"$f":"IF(AE4=AE5,AE5,ABS((AE5-AE4)/(AG5-AG4)))","v":13.949612403100769},{"$f":"IF(AF4=AF5,AF4,ABS((AF4-AF5)/(AG5-AG4)))","v":34.57558139534884}]
[null,"2.Click the icon of Run Rasch score",{"$nulls":12},{"$f":"MID(person!A6,1,1)","v":"A"},{"$f":"trust2!A6","v":0.7027159343710342},{"$f":"trust2!A6","v":0.7027159343710342},{"$f":"var!A6","v":1.647444617116336},{"$f":"'var2'!A6","v":1.303923845097414},{"$f":"person!A6","v":"A5"},{"$f":"LARGE(Q$2:Q2004,5)","v":{"v":1.5740673965772978,"d":"1.57"}},{"$f":"VLOOKUP(U6,Q$2:T2004,4,FALSE)","v":"B75"},{"$f":"LARGE(R$2:R2004,5)","v":{"v":4.549914903100174,"d":"4.55"}},{"$f":"VLOOKUP(W6,R$2:T2004,3,FALSE)","v":"B38"},1.1244146503393733,null,-2.6027,3.9464,0.138]
[null,"3.Scatter plot to see outlier person",{"$nulls":12},{"$f":"MID(person!A7,1,1)","v":"A"},{"$f":"trust2!A7","v":0.6550799896454451},{"$f":"trust2!A7","v":0.6550799896454451},{"$f":"var!A7","v":0.9637240491826292},{"$f":"'var2'!A7","v":1.3230218903321231},{"$f":"person!A7","v":"A6"},{"$f":"LARGE(Q$2:Q2005,6)","v":{"v":1.4883785864706727,"d":"1.49"}},{"$f":"VLOOKUP(U7,Q$2:T2005,4,FALSE)","v":"B56"},{"$f":"LARGE(R$2:R2005,6)","v":{"v":3.154935395332629,"d":"3.15"}},{"$f":"VLOOKUP(W7,R$2:T2005,3,FALSE)","v":"B37"},1.1268997993905296,null,-2.4756,3.738,0.1552]
[null,"4.Person item Map to see overall person dispersion",{"$nulls":12},{"$f":"MID(person!A8,1,1)","v":"A"},{"$f":"trust2!A8","v":1.1253200926556348},{"$f":"trust2!A8","v":1.1253200926556348},{"$f":"var!A8","v":0.8903101376901192},{"$f":"'var2'!A8","v":1.1013389159390554},{"$f":"person!A8","v":"A7"},{"$f":"LARGE(Q$2:Q2006,7)","v":{"v":1.447182067816287,"d":"1.45"}},{"$f":"VLOOKUP(U8,Q$2:T2006,4,FALSE)","v":"B32"},{"$f":"LARGE(R$2:R2006,7)","v":{"v":3.0723105568506757,"d":"3.07"}},{"$f":"VLOOKUP(W8,R$2:T2006,3,FALSE)","v":"B66"},1.2579019292873772,null,-2.1595,3.2836,0.2068]
[null,"5.According to the selected person on I18, eg G19 at person 138, and click ploi",{"$nulls":4},{"$f":"MAX(0.059972019726397,2.72564457772421)","v":2.72564457772421},{"$f":"MIN(-0.06,-4.83)","v":-4.83},{"$nulls":6},{"$f":"MID(person!A9,1,1)","v":"A"},{"$f":"trust2!A9","v":0.7063991830144746},{"$f":"trust2!A9","v":0.7063991830144746},{"$f":"var!A9","v":1.2379759024318637},{"$f":"'var2'!A9","v":1.3024072097576729},{"$f":"person!A9","v":"A8"},{"$f":"LARGE(Q$2:Q2007,8)","v":{"v":1.4309127616970672,"d":"1.43"}},{"$f":"VLOOKUP(U9,Q$2:T2007,4,FALSE)","v":"B33"},{"$f":"LARGE(R$2:R2007,8)","v":{"v":2.646276270199797,"d":"2.65"}},{"$f":"VLOOKUP(W9,R$2:T2007,3,FALSE)","v":"A9"},1.1121527771683761,null,-1.9859,3.0697,0.2414]
[null,"6. See person performance on Kidmap  ",{"$nulls":12},{"$f":"MID(person!A10,1,1)","v":"A"},{"$f":"trust2!A10","v":0.8545351830425777},{"$f":"trust2!A10","v":0.8545351830425777},{"$f":"var!A10","v":2.646276270199797},{"$f":"'var2'!A10","v":1.2371249616092084},{"$f":"person!A10","v":"A9"},{"$f":"LARGE(Q$2:Q2008,9)","v":{"v":1.4075824996494697,"d":"1.41"}},{"$f":"VLOOKUP(U10,Q$2:T2008,4,FALSE)","v":"B65"},{"$f":"LARGE(R$2:R2008,9)","v":{"v":2.4220017918802754,"d":"2.42"}},{"$f":"VLOOKUP(W10,R$2:T2008,3,FALSE)","v":"A4"},1.1723411766711784,null,-1.8326,2.9,0.2758]
[{"$nulls":14},{"$f":"MID(person!A11,1,1)","v":"A"},{"$f":"trust2!A11","v":1.2124487138643893},{"$f":"trust2!A11","v":1.2124487138643893},{"$f":"var!A11","v":0.15168400605221427},{"$f":"'var2'!A11","v":1.0548136047234087},{"$f":"person!A11","v":"A10"},{"$f":"LARGE(Q$2:Q2009,10)","v":{"v":1.3804226322605528,"d":"1.38"}},{"$f":"VLOOKUP(U11,Q$2:T2009,4,FALSE)","v":"B18"},{"$f":"LARGE(R$2:R2009,10)","v":{"v":2.156001582855338,"d":"2.16"}},{"$f":"VLOOKUP(W11,R$2:T2009,3,FALSE)","v":"B13"},1.301737913342408,null,-1.8326,2.9,0.2758]
[{"$nulls":14},{"$f":"MID(person!A12,1,1)","v":"A"},{"$f":"trust2!A12","v":0.5320187049290297},{"$f":"trust2!A12","v":0.5320187049290297},{"$f":"var!A12","v":0.9105162459838855},{"$f":"'var2'!A12","v":1.3675526455063702},{"$f":"person!A12","v":"A11"},{"$nulls":4},1.1015133660347796,null,-1.6946,2.7619,0.3104]
[{"$nulls":14},{"$f":"MID(person!A13,1,1)","v":"A"},{"$f":"trust2!A13","v":0.9008604826457333},{"$f":"trust2!A13","v":0.9008604826457333},{"$f":"var!A13","v":0.6654156661592182},{"$f":"'var2'!A13","v":1.2151844125594642},{"$f":"person!A13","v":"A12"},{"$nulls":4},1.1666393629966685,null,-1.6946,2.7619,0.3104]
[{"$nulls":14},{"$f":"MID(person!A14,1,1)","v":"B"},{"$f":"trust2!A14","v":0.861228699991923},{"$f":"trust2!A14","v":0.861228699991923},{"$f":"var!A14","v":2.156001582855338},{"$f":"'var2'!A14","v":1.2339952663068565},{"$f":"person!A14","v":"B13"},{"$nulls":4},1.1558671079402822,null,-1.6946,2.7619,0.3104]
[null," ",{"$nulls":8},"Delta<>0","Y",null,null,{"$f":"MID(person!A15,1,1)","v":"B"},{"$f":"trust2!A15","v":1.0223587933974891},{"$f":"trust2!A15","v":1.0223587933974891},{"$f":"var!A15","v":0.05026765136470467},{"$f":"'var2'!A15","v":1.1548857885398311},{"$f":"person!A15","v":"B14"},{"$nulls":4},1.2734910297067765,null,-1.6946,2.7619,0.3104]
[null," ",null,null,"F-value","p-value",{"$nulls":4},"Iteration",22,null,null,{"$f":"MID(person!A16,1,1)","v":"B"},{"$f":"trust2!A16","v":0.9894350439518281},{"$f":"trust2!A16","v":0.9894350439518281},{"$f":"var!A16","v":0.4721772941950444},{"$f":"'var2'!A16","v":1.1715769001461058},{"$f":"person!A16","v":"B15"},{"$nulls":4},1.2721187434542698,null,-1.6946,2.7619,0.3104]
[null,"疊代= 5 /22","R-square=",{"$f":"SUM(person!D2:'person'!D81)/SUM(person!C2:'person'!C81)","v":{"v":0.6492345616864467,"d":"0.65"}},{"$f":"SUM(person!D2:'person'!D81)/SUM(person!B2:'person'!B81)","v":{"v":1.8509080165021508,"d":"1.85"}},{"$f":"FDIST(1.85090801650215,1,479)","v":{"v":0.17431766498599746,"d":"0.17"}},{"$f":"MAX(data!B2:'data'!G81)","v":{"v":80,"d":"80.00"}},{"$f":"MIN(data!B2:'data'!G81)","v":16.25},{"$f":"COUNTIF(var!A2:A500,\">2\")","v":11},null,"Minimal",1E-4,"Reliabiltiy"," ",{"$f":"MID(person!A17,1,1)","v":"B"},{"$f":"trust2!A17","v":0.823629330045279},{"$f":"trust2!A17","v":0.823629330045279},{"$f":"var!A17","v":0.4261981449902595},{"$f":"'var2'!A17","v":1.251388569317384},{"$f":"person!A17","v":"B16"},{"$nulls":4},1.2032745564954246,null,-1.5686,2.6473,0.3448]
[null,80,{"$f":"(trust2!B1-trust2!C1)","v":0.18861143572469538},"item(1,2)_t",{"$f":"(trust2!B1-trust2!C1)/SQRT(1/'var2'!B1+1/'var2'!C1)","v":{"v":0.48164143773168466,"d":"0.48"}},{"$f":"TDIST(0.481641437731685,158,2)","v":{"v":0.6307271161043896,"d":"0.63"}},"select record in data",{"$nulls":5},{"v":0.8275796826682906,"d":"0.83"},"Obs.mean",{"$f":"MID(person!A18,1,1)","v":"B"},{"$f":"trust2!A18","v":1.157725229159442},{"$f":"trust2!A18","v":1.157725229159442},{"$f":"var!A18","v":0.9577278653827808},{"$f":"'var2'!A18","v":1.0841403784176302},{"$f":"person!A18","v":"B17"},{"$nulls":4},1.3453853617638414,null,-1.5686,2.6473,0.3448]
[null,"殘差和= 0<0.05",null,null,"Win over rate=",{"$f":"1-F18","v":{"v":0.3692728838956104,"d":"0.37"}},{"$f":"H22+1","v":60},{"$nulls":5},{"v":0.9958756742371735,"d":"1.00"},"Obs.-expect",{"$f":"MID(person!A19,1,1)","v":"B"},{"$f":"trust2!A19","v":1.3804226322605528},{"$f":"trust2!A19","v":1.3804226322605528},{"$f":"var!A19","v":0.9654019877851464},{"$f":"'var2'!A19","v":0.9634960137743264},{"$f":"person!A19","v":"B18"},{"$nulls":4},1.4674948550082099,null,-1.4523,2.5508,0.3794]
[{"$nulls":6},81,null,"Sum residual:",{"$f":"AVERAGE(var!B2:'var'!G81)","v":{"v":5.088522196198634e-18,"d":"0.00"}},{"$f":"SUMSQ(var!B2:'var'!G81)/(480)","v":{"v":0.997916666666665,"d":"1.00"}},{"$nulls":3},{"$f":"MID(person!A20,1,1)","v":"B"},{"$f":"trust2!A20","v":0.8889810450458856},{"$f":"trust2!A20","v":0.8889810450458856},{"$f":"var!A20","v":0.302034695930452},{"$f":"'var2'!A20","v":1.2208719528353544},{"$f":"person!A20","v":"B19"},{"$nulls":4},1.252196713098491,null,-1.3437,2.4686,0.4138]
[{"$nulls":6},{"$f":"MAX(4.2339596194967,0.150711228868777)","v":4.2339596194967},{"$f":"MIN(-4.5,-0.15)","v":-4.5},"Redidual:",{"$f":"residual!A1","v":{"v":1,"d":"1.00"}},{"$nulls":4},{"$f":"MID(person!A21,1,1)","v":"B"},{"$f":"trust2!A21","v":0.9021141338167086},{"$f":"trust2!A21","v":0.9021141338167086},{"$f":"var!A21","v":0.6252900823335715},{"$f":"'var2'!A21","v":1.214581822001691},{"$f":"person!A21","v":"B20"},{"$nulls":4},1.2476384243020717,null,-1.2417,2.398,0.4482]
[{"$nulls":3},{"$f":"MAX(2.37602333166225,0.470214179150147)","v":2.37602333166225},null," ",null,{"$f":"MATCH(I22,person!A2:A81,0)","v":59},"B59",{"$nulls":5},{"$f":"MID(person!A22,1,1)","v":"B"},{"$f":"trust2!A22","v":1.3244161416415203},{"$f":"trust2!A22","v":1.3244161416415203},{"$f":"var!A22","v":1.1907774966975675},{"$f":"'var2'!A22","v":0.9940639294916164},{"$f":"person!A22","v":"B21"},{"$nulls":4},1.4077991714106384,null,-1.2417,2.398,0.4482]
[{"$nulls":3},{"$f":"MIN(-0.06,-0.42)","v":-0.42},{"$nulls":10},{"$f":"MID(person!A23,1,1)","v":"B"},{"$f":"trust2!A23","v":1.1346686502534322},{"$f":"trust2!A23","v":1.1346686502534322},{"$f":"var!A23","v":0.29802394267442184},{"$f":"'var2'!A23","v":1.0963917963893985},{"$f":"person!A23","v":"B22"},{"$nulls":4},1.328774245638734,null,-1.2417,2.398,0.4482]
[null,null,"Wright range",0.2,{"$nulls":10},{"$f":"MID(person!A24,1,1)","v":"B"},{"$f":"trust2!A24","v":1.1859222221520271},{"$f":"trust2!A24","v":1.1859222221520271},{"$f":"var!A24","v":0.19918607400542995},{"$f":"'var2'!A24","v":1.0690692568788114},{"$f":"person!A24","v":"B23"},{"$nulls":4},1.3573490142703943,null,-1.1451,2.3369,0.4828]
[{"$nulls":3},{"$f":"MAX(trust!A2:'trust'!A81)","v":91.14},{"$nulls":10},{"$f":"MID(person!A25,1,1)","v":"B"},{"$f":"trust2!A25","v":1.100884764385988},{"$f":"trust2!A25","v":1.100884764385988},{"$f":"var!A25","v":0.5982734908334945},{"$f":"'var2'!A25","v":1.1142094535262064},{"$f":"person!A25","v":"B24"},{"$nulls":4},1.3060665922096786,null,-1.1451,2.3369,0.4828]
[{"$nulls":3},{"$f":"MIN(trust!A2:'trust'!A81)","v":48.56},{"$nulls":10},{"$f":"MID(person!A26,1,1)","v":"B"},{"$f":"trust2!A26","v":1.0111858227705928},{"$f":"trust2!A26","v":1.0111858227705928},{"$f":"var!A26","v":0.28377408912494106},{"$f":"'var2'!A26","v":1.1605764532954561},{"$f":"person!A26","v":"B25"},{"$nulls":4},1.263786478433093,null,-1.1451,2.3369,0.4828]
[{"$nulls":14},{"$f":"MID(person!A27,1,1)","v":"B"},{"$f":"trust2!A27","v":0.6509740497499945},{"$f":"trust2!A27","v":0.6509740497499945},{"$f":"var!A27","v":1.6795271198425905},{"$f":"'var2'!A27","v":1.3246219170491305},{"$f":"person!A27","v":"B26"},{"$nulls":4},1.1098070724777096,null,-1.0986,2.3094,0.5]
[{"$nulls":14},{"$f":"MID(person!A28,1,1)","v":"B"},{"$f":"trust2!A28","v":0.9131639796253272},{"$f":"trust2!A28","v":0.9131639796253272},{"$f":"var!A28","v":0.37225092045885094},{"$f":"'var2'!A28","v":1.2092512341659205},{"$f":"person!A28","v":"B27"},{"$nulls":4},1.2208019365660308,null,-1.0531,2.2837,0.5172]
[10410,14,4,{"$f":"B18","v":80},{"$f":"I17","v":11},{"$f":"E29/D29","v":{"v":0.1375,"d":"0.14"}},{"$f":"MID(B17,5,2)","v":"5 "},{"$f":"J21","v":{"v":1,"d":"1.00"}},{"$f":"M18","v":{"v":0.8275796826682906,"d":"0.83"}},{"$f":"M19","v":{"v":0.9958756742371735,"d":"1.00"}},{"$nulls":4},{"$f":"MID(person!A29,1,1)","v":"B"},{"$f":"trust2!A29","v":1.1014131724458234},{"$f":"trust2!A29","v":1.1014131724458234},{"$f":"var!A29","v":0.3872364398944777},{"$f":"'var2'!A29","v":1.1139320969688018},{"$f":"person!A29","v":"B28"},{"$nulls":6},-1.0531,2.2837,0.5172]
[{"$nulls":14},{"$f":"MID(person!A30,1,1)","v":"B"},{"$f":"trust2!A30","v":1.2642927188533477},{"$f":"trust2!A30","v":1.2642927188533477},{"$f":"var!A30","v":1.1568213359224264},{"$f":"'var2'!A30","v":1.0267776719303419},{"$f":"person!A30","v":"B29"},{"$nulls":4},1.3889362651994095,null,-0.9651,2.2374,0.5518]
[null," ",{"$nulls":12},{"$f":"MID(person!A31,1,1)","v":"B"},{"$f":"trust2!A31","v":1.0746944645650909},{"$f":"trust2!A31","v":1.0746944645650909},{"$f":"var!A31","v":0.4573661930251374},{"$f":"'var2'!A31","v":1.1278993335397183},{"$f":"person!A31","v":"B30"},{"$nulls":4},1.2876213480092753,null,-0.9651,2.2374,0.5518]
[{"$nulls":14},{"$f":"MID(person!A32,1,1)","v":"B"},{"$f":"trust2!A32","v":0.8106212137474202},{"$f":"trust2!A32","v":0.8106212137474202},{"$f":"var!A32","v":0.12625568471155796},{"$f":"'var2'!A32","v":1.2572969555766713},{"$f":"person!A32","v":"B31"},{"$nulls":4},1.2106051384694934,null,-0.8804,2.1969,0.5862]
[{"$nulls":14},{"$f":"MID(person!A33,1,1)","v":"B"},{"$f":"trust2!A33","v":1.447182067816287},{"$f":"trust2!A33","v":1.447182067816287},{"$f":"var!A33","v":0.680324105011837},{"$f":"'var2'!A33","v":0.9270697079370891},{"$f":"person!A33","v":"B32"},{"$nulls":4},1.4903131205151872,null,-0.8804,2.1969,0.5862]
[{"$nulls":14},{"$f":"MID(person!A34,1,1)","v":"B"},{"$f":"trust2!A34","v":1.4309127616970672},{"$f":"trust2!A34","v":1.4309127616970672},{"$f":"var!A34","v":0.32103965241524707},{"$f":"'var2'!A34","v":0.9359385398783409},{"$f":"person!A34","v":"B33"},{"$nulls":4},1.4856065307086552,null,-0.8804,2.1969,0.5862]
[{"$nulls":14},{"$f":"MID(person!A35,1,1)","v":"B"},{"$f":"trust2!A35","v":1.112362964463159},{"$f":"trust2!A35","v":1.112362964463159},{"$f":"var!A35","v":0.49704678022009685},{"$f":"'var2'!A35","v":1.1081748751774398},{"$f":"person!A35","v":"B34"},{"$nulls":4},1.305939577113843,null,-0.7985,2.1615,0.6206]
[{"$nulls":14},{"$f":"MID(person!A36,1,1)","v":"B"},{"$f":"trust2!A36","v":1.2892851313669085},{"$f":"trust2!A36","v":1.2892851313669085},{"$f":"var!A36","v":0.5181018287080887},{"$f":"'var2'!A36","v":1.0131989425323351},{"$f":"person!A36","v":"B35"},{"$nulls":4},1.4150146235298633,null,-0.7191,2.1307,0.6552]
[{"$nulls":14},{"$f":"MID(person!A37,1,1)","v":"B"},{"$f":"trust2!A37","v":1.009374713270051},{"$f":"trust2!A37","v":1.009374713270051},{"$f":"var!A37","v":0.1125685664379114},{"$f":"'var2'!A37","v":1.1614963923531618},{"$f":"person!A37","v":"B36"},{"$nulls":4},1.2836771407865828,null,-0.7191,2.1307,0.6552]
[null," ",{"$nulls":12},{"$f":"MID(person!A38,1,1)","v":"B"},{"$f":"trust2!A38","v":0.5431757222163025},{"$f":"trust2!A38","v":0.5431757222163025},{"$f":"var!A38","v":3.154935395332629},{"$f":"'var2'!A38","v":1.363820325519542},{"$f":"person!A38","v":"B37"},{"$nulls":4},1.078849460977936,null,-0.7191,2.1307,0.6552]
[{"$nulls":14},{"$f":"MID(person!A39,1,1)","v":"B"},{"$f":"trust2!A39","v":0.3861310621331479},{"$f":"trust2!A39","v":0.3861310621331479},{"$f":"var!A39","v":4.549914903100174},{"$f":"'var2'!A39","v":1.4102114779555048},{"$f":"person!A39","v":"B38"},{"$nulls":4},1.0252901413743347,null,-0.6419,2.1039,0.6896]
[{"$nulls":14},{"$f":"MID(person!A40,1,1)","v":"B"},{"$f":"trust2!A40","v":0.5629973222553226},{"$f":"trust2!A40","v":0.5629973222553226},{"$f":"var!A40","v":1.534549906298702},{"$f":"'var2'!A40","v":1.3570341995039061},{"$f":"person!A40","v":"B39"},{"$nulls":4},1.0943838999110616,null,-0.6419,2.1039,0.6896]
["雙因子變異數分析：無重複試驗(原始資料)",{"$nulls":13},{"$f":"MID(person!A41,1,1)","v":"B"},{"$f":"trust2!A41","v":1.1014948991191724},{"$f":"trust2!A41","v":1.1014948991191724},{"$f":"var!A41","v":0.05827640071708343},{"$f":"'var2'!A41","v":1.1138891954507555},{"$f":"person!A41","v":"B40"},{"$nulls":4},1.3250152862121523,null,-0.6419,2.1039,0.6896]
["變源","SS","自由度","MS","F","P-值","臨界值",{"$nulls":7},{"$f":"MID(person!A42,1,1)","v":"B"},{"$f":"trust2!A42","v":1.224103209713228},{"$f":"trust2!A42","v":1.224103209713228},{"$f":"var!A42","v":0.1039767897213552},{"$f":"'var2'!A42","v":1.0485295183837229},{"$f":"person!A42","v":"B41"},{"$nulls":4},1.3570086274851259,null,-0.5293,2.0704,0.7414]
["列",22841.01063681662,79,{"$f":"B43/C43","v":{"v":289.1267169217294,"d":"289.13"}},{"$f":"D43/D45","v":{"v":5.799780533266032,"d":"5.80"}},{"$f":"FDIST(E43,C43,C45)","v":{"v":1.1730181630288093E-32,"d":"0.00"}},{"$f":"FINV(0.05,C43,C45)","v":{"v":1.312743671147449,"d":"1.31"}},{"$nulls":7},{"$f":"MID(person!A43,1,1)","v":"B"},{"$f":"trust2!A43","v":0.7127342154803961},{"$f":"trust2!A43","v":0.7127342154803961},{"$f":"var!A43","v":0.1928058423616563},{"$f":"'var2'!A43","v":1.2997856206459928},{"$f":"person!A43","v":"B42"},{"$nulls":4},1.1408158009063496,null,-0.5293,2.0704,0.7414]
["欄",20103.270815256634,5,{"$f":"B44/C44","v":{"v":4020.6541630513266,"d":"4020.65"}},{"$f":"D44/D45","v":{"v":80.6529123082488,"d":"80.65"}},{"$f":"FDIST(E44,C44,C45)","v":{"v":3.4365496082967505E-58,"d":"0.00"}},{"$f":"FINV(0.05,C44,C45)","v":{"v":2.2368370601155085,"d":"2.24"}},{"$nulls":7},{"$f":"MID(person!A44,1,1)","v":"B"},{"$f":"trust2!A44","v":0.8006624685351489},{"$f":"trust2!A44","v":0.8006624685351489},{"$f":"var!A44","v":0.08503237011407917},{"$f":"'var2'!A44","v":1.261780888401403},{"$f":"person!A44","v":"B43"},{"$nulls":4},1.1929633093747722,null,-0.456,2.0522,0.7758]
["錯誤",19691.271510884355,395,{"$f":"B45/C45","v":{"v":49.85132028071989,"d":"49.85"}},{"$nulls":10},{"$f":"MID(person!A45,1,1)","v":"B"},{"$f":"trust2!A45","v":0.8112580123627746},{"$f":"trust2!A45","v":0.8112580123627746},{"$f":"var!A45","v":0.13211876950833384},{"$f":"'var2'!A45","v":1.2570090650474262},{"$f":"person!A45","v":"B44"},{"$nulls":4},1.196522129220684,null,-0.384,2.037,0.8104]
["WMS",null,{"$f":"C44+C45","v":400},{"$f":"(C44*D44+C45*D45)/(C44+C45)","v":{"v":99.48635581535247,"d":"99.49"}},{"$nulls":10},{"$f":"MID(person!A46,1,1)","v":"B"},{"$f":"trust2!A46","v":1.3320517018435598},{"$f":"trust2!A46","v":1.3320517018435598},{"$f":"var!A46","v":0.5212373831893057},{"$f":"'var2'!A46","v":0.9898996312168667},{"$f":"person!A46","v":"B45"},{"$nulls":4},1.4075323182225026,null,-0.3129,2.0245,0.8448]
["總和",62635.55296295761,479,{"$nulls":11},{"$f":"MID(person!A47,1,1)","v":"B"},{"$f":"trust2!A47","v":0.8477903324034902},{"$f":"trust2!A47","v":0.8477903324034902},{"$f":"var!A47","v":0.40259596880481735},{"$f":"'var2'!A47","v":1.2402643043953991},{"$f":"person!A47","v":"B46"},{"$nulls":4},1.2156596612038553,null,-0.3129,2.0245,0.8448]
["ICC(3,k)=",{"$f":"IF(ISERROR(ROUND((D43-D45)/D43,2)),\"\",ROUND((D43-D45)/D43,2))","v":0.83},"ICC(2,k)=",{"$f":"ROUND((D43-D45)/(D43+(D44-D45)/(C43+1)),2)","v":0.71},"ICC(1,k)=",{"$f":"IF(ROUND(D43,7)=0,0,ROUND((D43-D46)/D43,2))","v":0.66},"Cronbach's alpha",{"$nulls":7},{"$f":"MID(person!A48,1,1)","v":"B"},{"$f":"trust2!A48","v":1.1107402046506494},{"$f":"trust2!A48","v":1.1107402046506494},{"$f":"var!A48","v":0.37626214013306636},{"$f":"'var2'!A48","v":1.1090292576418113},{"$f":"person!A48","v":"B47"},{"$nulls":4},1.2945040706290165,null,-0.2426,2.0147,0.8794]
["ICC(3,1)=",{"$f":"ROUND((D43-D45)/(D43+C44*D45),2)","v":0.44},"ICC(2,1)=",{"$f":"ROUND((D43-D45)/(D43+C44*D45+(C44+1)*(D44-D45)/(C43+1)),2)","v":0.29},"ICC(1,1)=",{"$f":"ROUND((D43-D46)/(D43+2*D46),2)","v":0.39},{"$f":"IF(ROUND(D43,7)=0,0,(D43-D45)/D43)","v":{"v":0.8275796826682905,"d":"0.83"}},{"$nulls":7},{"$f":"MID(person!A49,1,1)","v":"B"},{"$f":"trust2!A49","v":1.075026116392888},{"$f":"trust2!A49","v":1.075026116392888},{"$f":"var!A49","v":0.43147704397917225},{"$f":"'var2'!A49","v":1.1277267007064542},{"$f":"person!A49","v":"B48"},{"$nulls":4},1.2826882997284565,null,-0.1728,2.0075,0.9138]
[{"$nulls":14},{"$f":"MID(person!A50,1,1)","v":"B"},{"$f":"trust2!A50","v":0.9947310821866281},{"$f":"trust2!A50","v":0.9947310821866281},{"$f":"var!A50","v":0.06169395891085053},{"$f":"'var2'!A50","v":1.1689081512618797},{"$f":"person!A50","v":"B49"},{"$nulls":4},1.2941139625340294,null,-0.1728,2.0075,0.9138]
["雙因子變異數分析：無重複試驗(期望值資料)",{"$nulls":13},{"$f":"MID(person!A51,1,1)","v":"B"},{"$f":"trust2!A51","v":1.1919404057633827},{"$f":"trust2!A51","v":1.1919404057633827},{"$f":"var!A51","v":1.2487056200035063},{"$f":"'var2'!A51","v":1.0658411769576615},{"$f":"person!A51","v":"B50"},{"$nulls":4},1.3382339516990518,null,-0.1035,2.0027,0.9482]
["變源","SS","自由度","MS","F","P-值","臨界值",{"$nulls":7},{"$f":"MID(person!A52,1,1)","v":"B"},{"$f":"trust2!A52","v":0.6673939959076504},{"$f":"trust2!A52","v":0.6673939959076504},{"$f":"var!A52","v":0.3299733908459838},{"$f":"'var2'!A52","v":1.318178684738745},{"$f":"person!A52","v":"B51"},{"$nulls":4},1.140034420785698,null,-0.1035,2.0027,0.9482]
["列",2.284051545167366,79,{"$f":"B53/C53","v":{"v":0.02891204487553628,"d":"0.03"}},{"$f":"D53/D55","v":{"v":242.4638734925425,"d":"242.46"}},{"$f":"FDIST(E53,C53,C55)","v":{"v":0,"d":"0.00"}},{"$f":"FINV(0.05,C53,C55)","v":{"v":1.312743671147449,"d":"1.31"}},{"$nulls":7},{"$f":"MID(person!A53,1,1)","v":"B"},{"$f":"trust2!A53","v":1.172766136851044},{"$f":"trust2!A53","v":1.172766136851044},{"$f":"var!A53","v":0.689314516061363},{"$f":"'var2'!A53","v":1.0761124348365572},{"$f":"person!A53","v":"B52"},{"$nulls":4},1.3651474888819044,null,-0.1035,2.0027,0.9482]
["欄",2.0094162939856526,5,{"$f":"B54/C54","v":{"v":0.4018832587971305,"d":"0.40"}},{"$f":"IF(ROUND(D55,10)=0,0,D54/D55)","v":{"v":3370.2967755908594,"d":"3370.30"}},{"$f":"FDIST(E54,C54,C55)","v":{"v":0,"d":"0.00"}},{"$f":"FINV(0.05,C54,C55)","v":{"v":2.2368370601155085,"d":"2.24"}},{"$nulls":7},{"$f":"MID(person!A54,1,1)","v":"B"},{"$f":"trust2!A54","v":0.8850091550559024},{"$f":"trust2!A54","v":0.8850091550559024},{"$f":"var!A54","v":0.7890514247490986},{"$f":"'var2'!A54","v":1.222764372544545},{"$f":"person!A54","v":"B53"},{"$nulls":4},1.2223299284976636,null,-0.1035,2.0027,0.9482]
["錯誤",0.0471008631567873,395,{"$f":"B55/C55","v":{"v":1.1924269153617038E-4,"d":"0.00"}},{"$nulls":10},{"$f":"MID(person!A55,1,1)","v":"B"},{"$f":"trust2!A55","v":0.5472073404750945},{"$f":"trust2!A55","v":0.5472073404750945},{"$f":"var!A55","v":0.28332940764190584},{"$f":"'var2'!A55","v":1.3624560693008878},{"$f":"person!A55","v":"B54"},{"$nulls":4},1.1304578844906685,null,-0.069,2.0012,0.9656]
["WMS",null,{"$f":"C54+C55","v":400},{"$f":"(C54*D54+C55*D55)/(C54+C55)","v":{"v":0.005141292892856099,"d":"0.01"}},{"$nulls":10},{"$f":"MID(person!A56,1,1)","v":"B"},{"$f":"trust2!A56","v":0.7650674991108039},{"$f":"trust2!A56","v":0.7650674991108039},{"$f":"var!A56","v":0.7311199172089237},{"$f":"'var2'!A56","v":1.2775179878493608},{"$f":"person!A56","v":"B55"},{"$nulls":4},1.152045615720571,null,-0.069,2.0012,0.9656]
["總和",4.340568702309806,479,{"$nulls":11},{"$f":"MID(person!A57,1,1)","v":"B"},{"$f":"trust2!A57","v":1.4883785864706727},{"$f":"trust2!A57","v":1.4883785864706727},{"$f":"var!A57","v":1.3152559261703791},{"$f":"'var2'!A57","v":0.9046563973468554},{"$f":"person!A57","v":"B56"},{"$nulls":4},1.4396558670088202,null,-0.069,2.0012,0.9656]
["ICC(3,k)=",{"$f":"IF(ISERROR(ROUND((D53-D55)/D53,2)),\"\",ROUND((D53-D55)/D53,2))","v":1},"ICC(2,k)=",{"$f":"ROUND((D53-D55)/(D53+(D54-D55)/(C53+1)),2)","v":0.85},"ICC(1,k)=",{"$f":"IF(ROUND(D53,7)=0,0,ROUND((D53-D56)/D53,2))","v":0.82},"Cronbach's alpha",{"$nulls":7},{"$f":"MID(person!A58,1,1)","v":"B"},{"$f":"trust2!A58","v":1.0469696955709509},{"$f":"trust2!A58","v":1.0469696955709509},{"$f":"var!A58","v":0.029008136446502186},{"$f":"'var2'!A58","v":1.1422606605036694},{"$f":"person!A58","v":"B57"},{"$nulls":4},1.3066775088649676,null,0.0345,2.0003,1.0172]
["ICC(3,1)=",{"$f":"ROUND((D53-D55)/(D53+C54*D55),2)","v":0.98},"ICC(2,1)=",{"$f":"ROUND((D53-D55)/(D53+C54*D55+(C54+1)*(D54-D55)/(C53+1)),2)","v":0.48},"ICC(1,1)=",{"$f":"ROUND((D53-D56)/(D53+2*D56),2)","v":0.61},{"$f":"IF(ROUND(D53,7)=0,0,(D53-D55)/D53)","v":{"v":0.9958756742371735,"d":"1.00"}},{"$nulls":7},{"$f":"MID(person!A59,1,1)","v":"B"},{"$f":"trust2!A59","v":1.3674659193320347},{"$f":"trust2!A59","v":1.3674659193320347},{"$f":"var!A59","v":1.3273156966713788},{"$f":"'var2'!A59","v":0.9705707104578124},{"$f":"person!A59","v":"B58"},{"$nulls":4},1.4733347099693972,null,0.0345,2.0003,1.0172]
[{"$nulls":14},{"$f":"MID(person!A60,1,1)","v":"B"},{"$f":"trust2!A60","v":1.2839967099119989},{"$f":"trust2!A60","v":1.2839967099119989},{"$f":"var!A60","v":5.559985345912676},{"$f":"'var2'!A60","v":1.0160749618497065},{"$f":"person!A60","v":"B59"},{"$nulls":4},1.6511856406297594,null,0.1382,2.0048,1.069]
[{"$nulls":14},{"$f":"MID(person!A61,1,1)","v":"B"},{"$f":"trust2!A61","v":1.8375608516021993},{"$f":"trust2!A61","v":1.8375608516021993},{"$f":"var!A61","v":1.0503247783700889},{"$f":"'var2'!A61","v":0.7209800140522435},{"$f":"person!A61","v":"B60"},{"$nulls":4},1.7691544152125178,null,0.2076,2.0108,1.1034]
[{"$nulls":3}," "," ",{"$nulls":9},{"$f":"MID(person!A62,1,1)","v":"B"},{"$f":"trust2!A62","v":1.3615195833521427},{"$f":"trust2!A62","v":1.3615195833521427},{"$f":"var!A62","v":0.6691311564063477},{"$f":"'var2'!A62","v":0.9738173112900277},{"$f":"person!A62","v":"B61"},{"$nulls":4},1.3715333108718328,null,0.2076,2.0108,1.1034]
[{"$nulls":14},{"$f":"MID(person!A63,1,1)","v":"B"},{"$f":"trust2!A63","v":-0.06040087073149826},{"$f":"trust2!A63","v":-0.06040087073149826},{"$f":"var!A63","v":5.185284136740546},{"$f":"'var2'!A63","v":1.4595087788174121},{"$f":"person!A63","v":"B62"},{"$nulls":4},1.0176312405601626,null,0.2426,2.0147,1.1206]
[{"$nulls":14},{"$f":"MID(person!A64,1,1)","v":"B"},{"$f":"trust2!A64","v":0.808421778035841},{"$f":"trust2!A64","v":0.808421778035841},{"$f":"var!A64","v":0.34835872778498955},{"$f":"'var2'!A64","v":1.2582902214566818},{"$f":"person!A64","v":"B63"},{"$nulls":4},1.2072203893699651,null,0.2426,2.0147,1.1206]
[{"$nulls":14},{"$f":"MID(person!A65,1,1)","v":"B"},{"$f":"trust2!A65","v":2.2059535386245703},{"$f":"trust2!A65","v":2.2059535386245703},{"$f":"var!A65","v":4.767462049277459},{"$f":"'var2'!A65","v":0.5493062036993944},{"$f":"person!A65","v":"B64"},{"$nulls":4},1.9826375031833532,null,0.2426,2.0147,1.1206]
[{"$nulls":14},{"$f":"MID(person!A66,1,1)","v":"B"},{"$f":"trust2!A66","v":1.4075824996494697},{"$f":"trust2!A66","v":1.4075824996494697},{"$f":"var!A66","v":0.22550362005142324},{"$f":"'var2'!A66","v":0.9486678206050928},{"$f":"person!A66","v":"B65"},{"$nulls":4},1.4599447173695106,null,0.3129,2.0245,1.1552]
[{"$nulls":14},{"$f":"MID(person!A67,1,1)","v":"B"},{"$f":"trust2!A67","v":2.376023331662253},{"$f":"trust2!A67","v":2.376023331662253},{"$f":"var!A67","v":3.0723105568506757},{"$f":"'var2'!A67","v":0.48004355634948226},{"$f":"person!A67","v":"B66"},{"$nulls":4},2.1641726886952615,null,0.3483,2.0304,1.1724]
[{"$nulls":14},{"$f":"MID(person!A68,1,1)","v":"B"},{"$f":"trust2!A68","v":1.2197263747274443},{"$f":"trust2!A68","v":1.2197263747274443},{"$f":"var!A68","v":0.47410400714668866},{"$f":"'var2'!A68","v":1.0508908867700668},{"$f":"person!A68","v":"B67"},{"$nulls":4},1.370662213341416,null,0.3483,2.0304,1.1724]
[{"$nulls":14},{"$f":"MID(person!A69,1,1)","v":"B"},{"$f":"trust2!A69","v":1.0152434672211184},{"$f":"trust2!A69","v":1.0152434672211184},{"$f":"var!A69","v":0.5385185883660322},{"$f":"'var2'!A69","v":1.1585128514543255},{"$f":"person!A69","v":"B68"},{"$nulls":4},1.3480978682401195,null,0.384,2.037,1.1896]
[{"$nulls":14},{"$f":"MID(person!A70,1,1)","v":"B"},{"$f":"trust2!A70","v":0.8645462153754336},{"$f":"trust2!A70","v":0.8645462153754336},{"$f":"var!A70","v":0.20949263305683044},{"$f":"'var2'!A70","v":1.2324388925287524},{"$f":"person!A70","v":"B69"},{"$nulls":4},1.1971182875108837,null,0.384,2.037,1.1896]
[{"$nulls":14},{"$f":"MID(person!A71,1,1)","v":"B"},{"$f":"trust2!A71","v":0.49062154673352243},{"$f":"trust2!A71","v":0.49062154673352243},{"$f":"var!A71","v":0.3797793475132171},{"$f":"'var2'!A71","v":1.3808368533267739},{"$f":"person!A71","v":"B70"},{"$nulls":4},1.1079969283190862,null,0.384,2.037,1.1896]
[{"$nulls":14},{"$f":"MID(person!A72,1,1)","v":"B"},{"$f":"trust2!A72","v":0.9462025279712573},{"$f":"trust2!A72","v":0.9462025279712573},{"$f":"var!A72","v":0.3583321443745436},{"$f":"'var2'!A72","v":1.1931136714572579},{"$f":"person!A72","v":"B71"},{"$nulls":4},1.2486410723135448,null,0.384,2.037,1.1896]
[{"$nulls":14},{"$f":"MID(person!A73,1,1)","v":"B"},{"$f":"trust2!A73","v":1.146645141148366},{"$f":"trust2!A73","v":1.146645141148366},{"$f":"var!A73","v":0.051733712086899815},{"$f":"'var2'!A73","v":1.0900365605799789},{"$f":"person!A73","v":"B72"},{"$nulls":4},1.326944666749972,null,0.456,2.0522,1.2242]
[{"$nulls":14},{"$f":"MID(person!A74,1,1)","v":"B"},{"$f":"trust2!A74","v":1.5789050882186244},{"$f":"trust2!A74","v":1.5789050882186244},{"$f":"var!A74","v":0.8204839262056339},{"$f":"'var2'!A74","v":0.8557573115442909},{"$f":"person!A74","v":"B73"},{"$nulls":4},1.5010210320484745,null,0.5293,2.0704,1.2586]
[{"$nulls":14},{"$f":"MID(person!A75,1,1)","v":"B"},{"$f":"trust2!A75","v":1.0918094707806074},{"$f":"trust2!A75","v":1.0918094707806074},{"$f":"var!A75","v":0.01860706926367021},{"$f":"'var2'!A75","v":1.118966027079303},{"$f":"person!A75","v":"B74"},{"$nulls":4},1.3153298404912184,null,0.5293,2.0704,1.2586]
[{"$nulls":14},{"$f":"MID(person!A76,1,1)","v":"B"},{"$f":"trust2!A76","v":1.5740673965772978},{"$f":"trust2!A76","v":1.5740673965772978},{"$f":"var!A76","v":2.0531981946457667},{"$f":"'var2'!A76","v":0.8583544740906612},{"$f":"person!A76","v":"B75"},{"$nulls":4},1.4953083195691415,null,0.5293,2.0704,1.2586]
[{"$nulls":14},{"$f":"MID(person!A77,1,1)","v":"B"},{"$f":"trust2!A77","v":1.1548192164041773},{"$f":"trust2!A77","v":1.1548192164041773},{"$f":"var!A77","v":0.710923234601065},{"$f":"'var2'!A77","v":1.0856882868971027},{"$f":"person!A77","v":"B76"},{"$nulls":4},1.3094600902009723,null,0.5293,2.0704,1.2586]
[{"$nulls":14},{"$f":"MID(person!A78,1,1)","v":"B"},{"$f":"trust2!A78","v":0.8835289764406602},{"$f":"trust2!A78","v":0.8835289764406602},{"$f":"var!A78","v":0.22965588463373207},{"$f":"'var2'!A78","v":1.2234684127340485},{"$f":"person!A78","v":"B77"},{"$nulls":4},1.2246484088180778,null,0.5664,2.0807,1.2758]
[{"$nulls":14},{"$f":"MID(person!A79,1,1)","v":"B"},{"$f":"trust2!A79","v":0.5583810167619204},{"$f":"trust2!A79","v":0.5583810167619204},{"$f":"var!A79","v":4.805329847607809},{"$f":"'var2'!A79","v":1.3586322187792927},{"$f":"person!A79","v":"B78"},{"$nulls":4},1.0425822985306044,null,0.6039,2.0919,1.2932]
[{"$nulls":14},{"$f":"MID(person!A80,1,1)","v":"B"},{"$f":"trust2!A80","v":0.3904412506235353},{"$f":"trust2!A80","v":0.3904412506235353},{"$f":"var!A80","v":1.1752045988696278},{"$f":"'var2'!A80","v":1.409122392679932},{"$f":"person!A80","v":"B79"},{"$nulls":4},1.0424542273895958,null,0.6039,2.0919,1.2932]
[{"$nulls":14},{"$f":"MID(person!A81,1,1)","v":"B"},{"$f":"trust2!A81","v":1.2710438511269417},{"$f":"trust2!A81","v":1.2710438511269417},{"$f":"var!A81","v":0.4902026271791679},{"$f":"'var2'!A81","v":1.0231130790930725},{"$f":"person!A81","v":"B80"},{"$nulls":4},1.3560458730946154,null,0.7191,2.1307,1.3448]
[{"$nulls":26},0.8391,2.1786,1.3966]
[{"$nulls":26},0.8804,2.1969,1.4138]
[{"$nulls":26},0.9651,2.2374,1.4482]
[{"$nulls":26},1.0531,2.2837,1.4828]
[{"$nulls":26},1.0986,2.3094,1.5]
[{"$nulls":26},1.1451,2.3369,1.5172]
[{"$nulls":26},1.1451,2.3369,1.5172]
[{"$nulls":26},1.1451,2.3369,1.5172]
[{"$nulls":26},1.1451,2.3369,1.5172]
[{"$nulls":26},1.2417,2.398,1.5518]
[{"$nulls":26},1.2417,2.398,1.5518]
[{"$nulls":26},1.3437,2.4686,1.5862]
[{"$nulls":26},1.4523,2.5508,1.6206]
[{"$nulls":26},1.4523,2.5508,1.6206]
[{"$nulls":26},1.4523,2.5508,1.6206]
[{"$nulls":26},1.4523,2.5508,1.6206]
[{"$nulls":26},1.4523,2.5508,1.6206]
[{"$nulls":26},1.5094,2.5971,1.638]
[0,{"$nulls":25},1.5686,2.6473,1.6552]
[null,{"$f":" AVERAGE(data!A2:A51)","v":0.5995999999999999},null," "," ",{"$nulls":21},1.5686,2.6473,1.6552]
[null,{"$f":" STDEV(data!A2:A51)","v":0.37448718677843246},{"$nulls":24},1.6946,2.7619,1.6896]
[null,{"$f":"AVERAGE(data!B2:B51)","v":60.85921219110072},{"$nulls":24},1.6946,2.7619,1.6896]
[{"$nulls":26},1.9071,2.9802,1.7414]
[null,{"$f":"discriminate!B1/discriminate2!B1","v":{"$error":"#DIV/0!"}},{"$f":"discriminate!C1/discriminate2!C1","v":{"$error":"#DIV/0!"}},{"$f":"discriminate!D1/discriminate2!D1","v":{"$error":"#DIV/0!"}},{"$f":"discriminate!E1/discriminate2!E1","v":{"$error":"#DIV/0!"}},{"$f":"discriminate!F1/discriminate2!F1","v":{"$error":"#DIV/0!"}},{"$f":"discriminate!G1/discriminate2!G1","v":{"$error":"#DIV/0!"}},{"$f":"discriminate!H1/discriminate2!H1","v":{"$error":"#DIV/0!"}},{"$f":"discriminate!I1/discriminate2!I1","v":{"$error":"#DIV/0!"}},{"$f":"discriminate!J1/discriminate2!J1","v":{"$error":"#DIV/0!"}},{"$f":"discriminate!K1/discriminate2!K1","v":{"$error":"#DIV/0!"}},{"$f":"discriminate!L1/discriminate2!L1","v":{"$error":"#DIV/0!"}},{"$f":"discriminate!M1/discriminate2!M1","v":{"$error":"#DIV/0!"}},{"$f":"discriminate!N1/discriminate2!N1","v":{"$error":"#DIV/0!"}},{"$nulls":6},{"$f":"discriminate!U1/discriminate2!U1","v":{"$error":"#DIV/0!"}},{"$f":"discriminate!V1/discriminate2!V1","v":{"$error":"#DIV/0!"}},{"$f":"discriminate!W1/discriminate2!W1","v":{"$error":"#DIV/0!"}},{"$f":"discriminate!X1/discriminate2!X1","v":{"$error":"#DIV/0!"}},{"$f":"discriminate!Y1/discriminate2!Y1","v":{"$error":"#DIV/0!"}},{"$f":"discriminate!Z1/discriminate2!Z1","v":{"$error":"#DIV/0!"}},1.9071,2.9802,1.7414]
[{"$nulls":26},1.9071,2.9802,1.7414]
[{"$nulls":26},1.9071,2.9802,1.7414]
[{"$nulls":26},2.0698,3.1701,1.7758]
[{"$nulls":26},2.1595,3.2836,1.7932]
[{"$nulls":26},2.3609,3.5629,1.8276]
[{"$nulls":26},2.3609,3.5629,1.8276]
[{"$nulls":26},2.3609,3.5629,1.8276]
[{"$nulls":26},2.6027,3.9464,1.862]
[{"$nulls":26},2.6027,3.9464,1.862]
[{"$nulls":26},2.9087,4.5153,1.8966]
[{"$nulls":26},3.3322,5.4804,1.931]
[{"$nulls":26},3.3322,5.4804,1.931]
[{"$nulls":26},3.6285,6.2994,1.9482]
[{"$nulls":26},4.0404,7.6724,1.9656]
[{"$nulls":26},4.0404,7.6724,1.9656]
[{"$nulls":26},4.0404,7.6724,1.9656]

{"sheet":"person","index":1,"n_rows":128,"n_cols":40,"rows_kept":128}
["科別","TSE","SST","Regress","Fit","theta",{"$nulls":14},{"$f":"MID([1]data!O1,1,6)","v":""},{"$f":"MID([1]data!P1,1,6)","v":""},{"$f":"MID([1]data!Q1,1,6)","v":""},{"$f":"MID([1]data!R1,1,6)","v":""},"MEASURE","loading",{"$f":"CORREL(E2:E54,Z2:Z54)","v":0.013303835712242083},"Mean","Outfit","Outlier","Region ",null,{"$f":"AVERAGE(E2:E81)","v":{"v":0.9979166666666645,"d":"1.00"}},"RADIANS","度","Cos","Sin",{"$f":"AG2","v":1.2357938073266648},"F-value","Prob."]
["A1",{"v":0.01960393972649767,"d":"0.01960"},0.023711374492528123,{"v":0.004107434766030454,"d":"0.00"},{"$f":"var!A2","v":{"v":0.7586785373737212,"d":"0.76"}},{"$f":"trust2!A2","v":{"v":1.119952169469898,"d":"1.12"}},null,{"$f":"ROUND(PERCENTILE(trust!B2:'trust'!B81,0.05),2)","v":59.22},{"$f":"ROUND(PERCENTILE(trust!C2:'trust'!C81,0.05),2)","v":66.84},{"$f":"ROUND(PERCENTILE(trust!D2:'trust'!D81,0.05),2)","v":54},{"$f":"ROUND(PERCENTILE(trust!E2:'trust'!E81,0.05),2)","v":59.85},{"$f":"ROUND(PERCENTILE(trust!F2:'trust'!F81,0.05),2)","v":53.47},{"$f":"ROUND(PERCENTILE(trust!G2:'trust'!G81,0.05),2)","v":55.75},{"$nulls":19},{"$f":"STDEV(E2:E81)","v":1.2357938073266648},0,0,{"$f":"$AL$1*COS(AH2)+$AG$1","v":2.2337104739933293},{"$f":"$AL$2*SIN(AH2)+AG$3","v":1.0294698432831253},{"$f":"AG4*2","v":0.760175483179726},0.20952088321709333,{"$f":"FDIST(0.209520883217093,1,1)","v":0.7267199483148292}]
["A2",{"v":0.003101360271725425,"d":"0.00310"},0.04404194787165529,{"v":0.04094058759992986,"d":"0.04"},{"$f":"var!A3","v":{"v":0.1451791873612854,"d":"0.15"}},{"$f":"trust2!A3","v":{"v":1.3656374632439923,"d":"1.37"}},null,{"$f":"ROUND(AVERAGE(trust!B2:'trust'!B81),2)","v":77.23},{"$f":"ROUND(AVERAGE(trust!C2:'trust'!C81),2)","v":80.31},{"$f":"ROUND(AVERAGE(trust!D2:'trust'!D81),2)","v":74.75},{"$f":"ROUND(AVERAGE(trust!E2:'trust'!E81),2)","v":75.81},{"$f":"ROUND(AVERAGE(trust!F2:'trust'!F81),2)","v":63.18},{"$f":"ROUND(AVERAGE(trust!G2:'trust'!G81),2)","v":64.43},{"$nulls":11},-0.9,{"v":0.9457029068121211,"d":".946"},{"$f":"CORREL(AB2:AB53,AC2:AC53)","v":-0.49231354847335296},72,{"v":0.6265454545454545,"d":"0.63"},{"$f":"1-AC3/(1+AC3)","v":{"v":0.6147999105745585,"d":"0.61"}},"East South Central","AL",{"$f":"AVERAGE(F2:F81)","v":{"v":1.0294698432831253,"d":"1.03"}},0.3490658503988659,20,{"$f":"$AL$1*COS(AH3)+$AG$1","v":2.159182988224454},{"$f":"$AL$2*SIN(AH3)+AG$3","v":1.2894651709929148},null,13.200848664109825,{"$f":"FDIST(13.2008486641098,1,1)","v":0.17098459500713878}]
["A3",{"v":0.031580109589355365,"d":"0.03158"},0.04292461070947707,{"v":0.011344501120121704,"d":"0.01"},{"$f":"var!A4","v":{"v":1.0185768021652521,"d":"1.02"}},{"$f":"trust2!A4","v":{"v":0.7777326865661225,"d":"0.78"}},null,{"$f":"ROUND(PERCENTILE(trust!B2:'trust'!B81,0.95),2)","v":90.68},{"$f":"ROUND(PERCENTILE(trust!C2:'trust'!C81,0.95),2)","v":92.87},{"$f":"ROUND(PERCENTILE(trust!D2:'trust'!D81,0.95),2)","v":90.63},{"$f":"ROUND(PERCENTILE(trust!E2:'trust'!E81,0.95),2)","v":89.32},{"$f":"ROUND(PERCENTILE(trust!F2:'trust'!F81,0.95),2)","v":75.12},{"$f":"ROUND(PERCENTILE(trust!G2:'trust'!G81,0.95),2)","v":73.21},{"$nulls":11},-0.94,{"v":0.9684392300832316,"d":".968"},null,71,{"v":0.33742727272727274,"d":"0.34"},{"v":0.7477042082152301,"d":"0.75"},"West South Central","AR",{"$f":"STDEV(F2:F81)","v":0.380087741589863},0.6981317007977318,40,1.944589645610101,1.5181012250585315,null,0.3592293145159182,{"$f":"FDIST(0.359229314515918,1,1)","v":0.6562591404442626}]
["A4",{"v":0.08040329495290086,"d":"0.08040"},0.14714057828103985,{"v":0.066737283328139,"d":"0.07"},{"$f":"var!A5","v":{"v":2.4220017918802754,"d":"2.42"}},{"$f":"trust2!A5","v":{"v":0.47590306668044857,"d":"0.48"}},null,{"v":75.89285714285714,"d":"75.89"},{"v":100,"d":"100.00"},81.25,{"v":53.125,"d":"53.13"},{"v":83.33333333333334,"d":"83.33"},{"v":73.21428571428571,"d":"73.21"},{"$nulls":11},-0.92,{"v":0.9921295628893294,"d":".992"},null,69,{"v":0.4689272727272727,"d":"0.47"},{"v":0.6807688975257145,"d":"0.68"},"Mountain","AZ",null,1.0471975511965976,60,1.615813570329997,1.6878011230508783,null,0.8300316966765203,{"$f":"FDIST(0.83003169667652,1,1)","v":0.5296064150259139}]
["A5",{"v":0.052267811556331145,"d":"0.05227"},0.05968209230353857,{"v":0.007414280747207423,"d":"0.01"},{"$f":"var!A6","v":{"v":1.647444617116336,"d":"1.65"}},{"$f":"trust2!A6","v":{"v":0.7027159343710342,"d":"0.70"}},null,{"$f":"ROUND(STDEV(trust!B2:'trust'!B81)/1,2)","v":10.64},{"$f":"ROUND(STDEV(trust!C2:'trust'!C81)/1,2)","v":8.69},{"$f":"ROUND(STDEV(trust!D2:'trust'!D81)/1,2)","v":12.59},{"$f":"ROUND(STDEV(trust!E2:'trust'!E81)/1,2)","v":10.21},{"$f":"ROUND(STDEV(trust!F2:'trust'!F81)/1,2)","v":7.76},{"$f":"ROUND(STDEV(trust!G2:'trust'!G81)/1,2)","v":5.19},{"$nulls":11},-0.94,{"v":0.9768819763991659,"d":".977"},null,67,{"v":1.1347818181818181,"d":"1.13"},{"v":0.4684319453552843,"d":"0.47"},"Pacific","CA",null,1.3962634015954636,80,1.2125100092810175,1.7780965527683208,null,0.14185175400383374,{"$f":"FDIST(0.141851754003834,1,1)","v":0.77068904752005}]
["A6",{"v":0.032025706013966024,"d":"0.03203"},0.03932006157050178,{"v":0.007294355556535757,"d":"0.01"},{"$f":"var!A7","v":{"v":0.9637240491826292,"d":"0.96"}},{"$f":"trust2!A7","v":{"v":0.6550799896454451,"d":"0.66"}},{"$nulls":18},-0.96,{"v":0.9892716469197455,"d":".989"},null,73,{"v":0.5445454545454546,"d":"0.54"},{"v":0.6474396703943496,"d":"0.65"},"Mountain","CO",null,1.7453292519943295,100,0.7833233240523115,1.7780965527683208,null,0.22776564405339814,{"$f":"FDIST(0.227765644053398,1,1)","v":0.7165253773756574}]
["A7",{"v":0.022281696131694898,"d":"0.02228"},0.02919746831731531,{"v":6.915772185620412E-3,"d":"0.01"},{"$f":"var!A8","v":{"v":0.8903101376901192,"d":"0.89"}},{"$f":"trust2!A8","v":{"v":1.1253200926556348,"d":"1.13"}},{"$nulls":18},-0.93,{"v":0.9772656603733937,"d":".977"},null,68,{"v":0.5861727272727272,"d":"0.59"},{"v":0.6304483634133622,"d":"0.63"},"New England","CT",null,2.0943951023931953,120,0.3800197630033323,1.6878011230508783,null,0.3103790727934297,{"$f":"FDIST(0.31037907279343,1,1)","v":0.6764120892192869}]
["A8",{"v":0.03957580198650873,"d":"0.03958"},0.04511066604441691,{"v":0.005534864057908179,"d":"0.01"},{"$f":"var!A9","v":{"v":1.2379759024318637,"d":"1.24"}},{"$f":"trust2!A9","v":{"v":0.7063991830144746,"d":"0.71"}},null,{"$f":"ROUND(STDEV(trust!B2:'trust'!B81)/8.88819441731559,2)","v":1.2},{"$f":"ROUND(STDEV(trust!C2:'trust'!C81)/8.88819441731559,2)","v":0.98},{"$f":"ROUND(STDEV(trust!D2:'trust'!D81)/8.88819441731559,2)","v":1.42},{"$f":"ROUND(STDEV(trust!E2:'trust'!E81)/8.88819441731559,2)","v":1.15},{"$f":"ROUND(STDEV(trust!F2:'trust'!F81)/8.88819441731559,2)","v":0.87},{"$f":"ROUND(STDEV(trust!G2:'trust'!G81)/8.88819441731559,2)","v":0.58},{"$nulls":11},-0.94,{"v":0.9724714188802803,"d":".972"},null,62,{"v":7.764881818181817,"d":"7.76"},{"v":0.11409166954488825,"d":"0.11"},"South Atlantic","DC",null,2.443460952792061,140,0.05124368772322807,1.5181012250585315,null,0.13985475417011126,{"$f":"FDIST(0.139854754170111,1,1)","v":0.7721736774657776}]
["A9",{"v":0.08089762878564549,"d":"0.08090"},0.04937364457590501,{"v":-0.03152398420974048,"d":"-0.03"},{"$f":"var!A10","v":{"v":2.646276270199797,"d":"2.65"}},{"$f":"trust2!A10","v":{"v":0.8545351830425777,"d":"0.85"}},{"$nulls":18},-0.92,{"v":0.9768937151147206,"d":".977"},null,68,{"v":0.5348636363636363,"d":"0.53"},{"v":0.6515236769627151,"d":"0.65"},"South Atlantic","DE",null,2.792526803190927,160,-0.16334965489112496,1.2894651709929148,null,-0.3896774810701758,{"$f":"FDIST(-0.389677481070176,1,1)","v":{"$error":"#NUM!"}}]
["A10",{"v":0.00364053524344611,"d":"0.00364"},0.04223596856283879,{"v":0.03859543331939268,"d":"0.04"},{"$f":"var!A11","v":{"v":0.15168400605221427,"d":"0.15"}},{"$f":"trust2!A11","v":{"v":1.2124487138643893,"d":"1.21"}},{"$nulls":3},{"$f":"CHIDIST(H8:M11,6)","v":{"v":0,"d":"0.0000"}},{"$f":"SUM(trust!B1:G1)","v":{"v":435.71000000000004,"d":"435.7100"}},{"$nulls":11},{"$f":" AVERAGE(data!#REF!)","v":{"$error":"#REF!"}},null,-0.97,{"v":0.9936078955755357,"d":".994"},null,67,{"v":1.2714545454545456,"d":"1.27"},{"v":0.4402465380613143,"d":"0.44"},"South Atlantic","FL",null,3.141592653589793,180,-0.23787714066000032,1.0294698432831253,null,10.601582113200053,{"$f":"FDIST(10.6015821132001,1,1)","v":0.18970013548904838}]
["A11",{"v":0.030147249406374463,"d":"0.03015"},0.15386100774293357,{"v":0.12371375833655911,"d":"0.12"},{"$f":"var!A12","v":{"v":0.9105162459838855,"d":"0.91"}},{"$f":"trust2!A12","v":{"v":0.5320187049290297,"d":"0.53"}},{"$nulls":16},{"$f":" STDEV(data!#REF!)","v":{"$error":"#REF!"}},null,-0.95,{"v":0.9725455484506654,"d":".973"},null,70,{"v":0.23486363636363639,"d":"0.23"},{"v":0.8098060146501269,"d":"0.81"},"South Atlantic","GA",null,3.490658503988659,200,-0.16334965489112518,0.769474515573336,null,4.103649943944821,{"$f":"FDIST(4.10364994394482,1,1)","v":0.2919225006924747}]
["A12",{"v":0.01889706636631134,"d":"0.01890"},0.027253271748697978,{"v":0.008356205382386638,"d":"0.01"},{"$f":"var!A13","v":{"v":0.6654156661592182,"d":"0.67"}},{"$f":"trust2!A13","v":{"v":0.9008604826457333,"d":"0.90"}},{"$nulls":16},{"$f":"AVERAGE(data!#REF!)","v":{"$error":"#REF!"}},null,-0.93,{"v":0.9829251843656445,"d":".983"},null,71,{"v":0.2715636363636364,"d":"0.27"},{"v":0.7864333104552734,"d":"0.79"},"Pacific","HI",null,3.839724354387525,220,0.05124368772322796,0.5408384615077191,null,0.44219590598907066,{"$f":"FDIST(0.442195905989071,1,1)","v":0.6264106991055017}]
["B13",{"v":0.06271189627483026,"d":"0.06271"},0.051154354836405375,{"v":-0.011557541438424884,"d":"-0.01"},{"$f":"var!A14","v":{"v":2.156001582855338,"d":"2.16"}},{"$f":"trust2!A14","v":{"v":0.861228699991923,"d":"0.86"}},{"$nulls":18},-0.96,{"v":0.9879161031430728,"d":".988"},null,74,{"v":0.8389818181818183,"d":"0.84"},{"v":0.5437791663371034,"d":"0.54"},"West North Central","IA",null,4.1887902047863905,240,0.3800197630033315,0.37113856351537255,null,-0.18429583739223593,{"$f":"FDIST(-0.184295837392236,1,1)","v":{"$error":"#NUM!"}}]
["B14",{"v":1.2144052325499296E-3,"d":"0.00121"},0.02846301203144544,{"v":0.02724860679889551,"d":"0.03"},{"$f":"var!A15","v":{"v":0.05026765136470467,"d":"0.05"}},{"$f":"trust2!A15","v":{"v":1.0223587933974891,"d":"1.02"}},{"$nulls":18},-0.96,{"v":0.9881053912304075,"d":".988"},null,73,{"v":0.6100636363636364,"d":"0.61"},{"v":0.6210934632736143,"d":"0.62"},"Mountain","ID",null,4.537856055185257,260,0.7833233240523115,0.2808431337979298,null,22.43782064548639,{"$f":"FDIST(22.4378206454864,1,1)","v":0.13245222750072885}]
["B15",{"v":0.013509489797851357,"d":"0.01351"},0.06460833461277271,{"v":0.05109884481492136,"d":"0.05"},{"$f":"var!A16","v":{"v":0.4721772941950444,"d":"0.47"}},{"$f":"trust2!A16","v":{"v":0.9894350439518281,"d":"0.99"}},{"$nulls":18},-0.95,{"v":0.9984626662713145,"d":".998"},null,70,{"v":0.02119090909090909,"d":"0.02"},{"v":0.9792488271269729,"d":"0.98"},"East North Central","IL",null,4.886921905584122,280,1.212510009281017,0.2808431337979297,null,3.7824407567966385,{"$f":"FDIST(3.78244075679664,1,1)","v":0.3023472708674613}]
["B16",{"v":0.012959144446008463,"d":"0.01296"},0.07134753054931338,{"v":0.058388386103304914,"d":"0.06"},{"$f":"var!A17","v":{"v":0.4261981449902595,"d":"0.43"}},{"$f":"trust2!A17","v":{"v":0.823629330045279,"d":"0.82"}},{"$nulls":3},5.559985345912676,{"$nulls":14},-0.96,{"v":0.9939243248209577,"d":".994"},null,73,{"v":0.47337272727272733,"d":"0.47"},{"v":0.6787148842174109,"d":"0.68"},"East North Central","IN",null,5.235987755982989,300,1.615813570329997,0.37113856351537233,null,4.505574140836827,{"$f":"FDIST(4.50557414083683,1,1)","v":0.28028584659836536}]
["B17",{"v":0.02681657093091491,"d":"0.02682"},0.09998887961756588,{"v":0.07317230868665096,"d":"0.07"},{"$f":"var!A18","v":{"v":0.9577278653827808,"d":"0.96"}},{"$f":"trust2!A18","v":{"v":1.157725229159442,"d":"1.16"}},null,{"v":-1.0349129455087545,"d":"-1.03"},{"v":2.75278304517642,"d":"2.75"},{"v":0.2192189985080128,"d":"0.22"},{"v":-4.548456434851554,"d":"-4.55"},{"v":1.957860706111584,"d":"1.96"},{"v":0.3759272845891502,"d":"0.38"},{"$nulls":11},-0.96,{"v":0.9859142479478287,"d":".986"},null,74,{"v":0.8977636363636363,"d":"0.90"},{"v":0.5269360108069785,"d":"0.53"},"West North Central","KS",null,5.585053606381854,320,1.9445896456101006,0.5408384615077189,null,2.7286228681197953,{"$f":"FDIST(2.7286228681198,1,1)","v":0.34655426859762445}]
["B18",{"v":0.024550038361102124,"d":"0.02455"},0.1077289496256848,{"v":0.08317891126458268,"d":"0.08"},{"$f":"var!A19","v":{"v":0.9654019877851464,"d":"0.97"}},{"$f":"trust2!A19","v":{"v":1.3804226322605528,"d":"1.38"}},null,{"v":82.74073122030708,"d":"82.74"},{"v":86.04050400495741,"d":"86.04"},{"v":80.08377131578342,"d":"80.08"},{"v":81.21940740400724,"d":"81.22"},{"v":67.68819627734041,"d":"67.69"},{"v":69.02738977760436,"d":"69.03"},{"$nulls":11},-0.96,{"v":0.9963024857378753,"d":".996"},null,72,{"v":0.25876363636363636,"d":"0.26"},{"v":0.7944303212387336,"d":"0.79"},"East South Central","KY",null,5.934119456780721,340,2.159182988224454,0.769474515573336,null,3.3881377308303535,{"$f":"FDIST(3.38813773083035,1,1)","v":0.3168234843625869}]
["B19",{"v":0.008075750231913049,"d":"0.00808"},0.047991751840821814,{"v":0.03991600160890876,"d":"0.04"},{"$f":"var!A20","v":{"v":0.302034695930452,"d":"0.30"}},{"$f":"trust2!A20","v":{"v":0.8889810450458856,"d":"0.89"}},null,{"v":-0.22892132807283674,"d":"-0.23"},{"v":-0.4175327637975321,"d":"-0.42"},{"v":-0.0899327721153805,"d":"-0.09"},{"v":-0.14828542287372726,"d":"-0.15"},{"v":0.47021417915014746,"d":"0.47"},{"v":0.41445810770932906,"d":"0.41"},{"$nulls":11},-0.91,{"v":0.9487662918016321,"d":".949"},null,75,{"v":2.440054545454545,"d":"2.44"},{"v":0.29069306512053195,"d":"0.29"},"West South Central","LA",null,6.283185307179586,360,2.2337104739933293,1.029469843283125,null,4.9426988778296,{"$f":"FDIST(4.9426988778296,1,1)","v":0.2690904418635516}]
["B20",{"v":0.01821905380670873,"d":"0.01822"},0.07790184928334952,{"v":0.05968279547664079,"d":"0.06"},{"$f":"var!A21","v":{"v":0.6252900823335715,"d":"0.63"}},{"$f":"trust2!A21","v":{"v":0.9021141338167086,"d":"0.90"}},{"$f":"2*(AVERAGE(H5:W5)-G16)/G15","v":{"$error":"#DIV/0!"}},1,2,3,4,5,6,7,8," "," "," ",{"$nulls":6},-0.91,{"v":0.9634790491821553,"d":".963"},null,69,{"v":0.40817272727272713,"d":"0.41"},{"v":0.7101401558434852,"d":"0.71"},"New England","MA",{"$nulls":6},3.2758449538506786,{"$f":"FDIST(3.27584495385068,1,1)","v":0.32134431235957467}]
["B21",{"v":0.031063441058471628,"d":"0.03106"},0.11482769652281095,{"v":0.08376425546433933,"d":"0.08"},{"$f":"var!A22","v":{"v":1.1907774966975675,"d":"1.19"}},{"$f":"trust2!A22","v":{"v":1.3244161416415203,"d":"1.32"}},{"v":0.005993742247889509,"d":"0.01"},{"$nulls":17},-0.97,{"v":0.9764701586347156,"d":".976"},null,65,{"v":2.9476,"d":"2.95"},{"v":0.25331847198297697,"d":"0.25"},"South Atlantic","MD",{"$nulls":6},2.6965542969520797,{"$f":"FDIST(2.69655429695208,1,1)","v":0.3482236954433632}]
["B22",{"v":0.008500761015656451,"d":"0.00850"},0.05985202403884505,{"v":0.0513512630231886,"d":"0.05"},{"$f":"var!A23","v":{"v":0.29802394267442184,"d":"0.30"}},{"$f":"trust2!A23","v":{"v":1.1346686502534322,"d":"1.13"}},null,{"v":9.16779403961767,"d":"9.17"},{"v":5.458589413181434,"d":"5.46"},{"v":3.9105123803928663,"d":"3.91"},{"v":2.6252553135837595,"d":"2.63"},{"v":5.204517891905568,"d":"5.20"},{"v":3.2595874143610257,"d":"3.26"},{"v":2.7580952296248236,"d":"2.76"},{"v":2.3747593918786243,"d":"2.37"},{"$nulls":9},-0.89,{"v":0.959837388225113,"d":".960"},null,75,{"v":1.9796272727272728,"d":"1.98"},{"v":0.33561244695035064,"d":"0.34"},"New England","ME",{"$nulls":6},6.040784222566821,{"$f":"FDIST(6.04078422256682,1,1)","v":0.24599806198228144}]
["B23",{"v":0.0053342868049206,"d":"0.00533"},0.04864763459509089,{"v":0.043313347790170285,"d":"0.04"},{"$f":"var!A24","v":{"v":0.19918607400542995,"d":"0.20"}},{"$f":"trust2!A24","v":{"v":1.1859222221520271,"d":"1.19"}},{"$nulls":18},-0.96,{"v":0.9945265920837482,"d":".995"},null,71,{"v":0.10394545454545455,"d":"0.10"},{"v":0.9058418564817102,"d":"0.91"},"East North Central","MI",{"$nulls":6},8.119801085726397,{"$f":"FDIST(8.1198010857264,1,1)","v":0.21486425668783574}]
["B24",{"v":0.017299003066376044,"d":"0.01730"},0.07903207997820358,{"v":0.061733076911827535,"d":"0.06"},{"$f":"var!A25","v":{"v":0.5982734908334945,"d":"0.60"}},{"$f":"trust2!A25","v":{"v":1.100884764385988,"d":"1.10"}},{"$nulls":18},-0.96,{"v":0.9866209665579252,"d":".987"},null,74,{"v":0.8772727272727273,"d":"0.88"},{"v":0.5326876513317191,"d":"0.53"},"West North Central","MN",{"$nulls":6},3.5685915931084895,{"$f":"FDIST(3.56859159310849,1,1)","v":0.30994421287480317}]
["B25",{"v":0.007796663550927792,"d":"0.00780"},0.045447348323321174,{"v":0.03765068477239338,"d":"0.04"},{"$f":"var!A26","v":{"v":0.28377408912494106,"d":"0.28"}},{"$f":"trust2!A26","v":{"v":1.0111858227705928,"d":"1.01"}},{"$nulls":18},-0.95,{"v":0.99766438597954,"d":".998"},null,71,{"v":0.049600000000000005,"d":"0.05"},{"v":0.9527439024390244,"d":"0.95"},"West North Central","MO",{"$nulls":6},4.829076505156235,{"$f":"FDIST(4.82907650515623,1,1)","v":0.27187053420720586}]
["B26",{"v":0.05564936844662007,"d":"0.05565"},0.04846024607616989,{"v":-0.007189122370450184,"d":"-0.01"},{"$f":"var!A27","v":{"v":1.6795271198425905,"d":"1.68"}},{"$f":"trust2!A27","v":{"v":0.6509740497499945,"d":"0.65"}},{"$nulls":18},-0.87,{"v":0.9168989336516729,"d":".917"},null,73,{"v":1.1784818181818182,"d":"1.18"},{"v":0.45903527477434236,"d":"0.46"},"East South Central","MS",{"$nulls":6},-0.12918605495669058,{"$f":"FDIST(-0.129186054956691,1,1)","v":{"$error":"#NUM!"}}]
["B27",{"v":0.011066297384642005,"d":"0.01107"},0.05292086205856154,{"v":0.04185456467391953,"d":"0.04"},{"$f":"var!A28","v":{"v":0.37225092045885094,"d":"0.37"}},{"$f":"trust2!A28","v":{"v":0.9131639796253272,"d":"0.91"}},{"$nulls":18},-0.95,{"v":0.9892435643275828,"d":".989"},null,69,{"v":0.23279090909090908,"d":"0.23"},{"v":0.8111675650961971,"d":"0.81"},"Mountain","MT",{"$nulls":6},3.7821651830905973,{"$f":"FDIST(3.7821651830906,1,1)","v":0.30235670219138866}]
["B28",{"v":0.01086708543926865,"d":"0.01087"},0.05609212452453022,{"v":0.04522503908526157,"d":"0.05"},{"$f":"var!A29","v":{"v":0.3872364398944777,"d":"0.39"}},{"$f":"trust2!A29","v":{"v":1.1014131724458234,"d":"1.10"}},{"$nulls":18},-0.96,{"v":0.9944642706712689,"d":".994"},null,71,{"v":0.18742727272727275,"d":"0.19"},{"v":0.8421568402275355,"d":"0.84"},"South Atlantic","NC",{"$nulls":6},4.161653033649581,{"$f":"FDIST(4.16165303364958,1,1)","v":0.2901529815964753}]
["B29",{"v":0.02947183229013091,"d":"0.02947"},0.09700180427431532,{"v":0.06752997198418441,"d":"0.07"},{"$f":"var!A30","v":{"v":1.1568213359224264,"d":"1.16"}},{"$f":"trust2!A30","v":{"v":1.2642927188533477,"d":"1.26"}},{"$nulls":18},-0.96,{"v":0.9686971986004609,"d":".969"},null,72,{"v":0.5439181818181819,"d":"0.54"},{"v":0.6477027162296636,"d":"0.65"},"West North Central","ND",{"$nulls":6},2.291339449797217,{"$f":"FDIST(2.29133944979722,1,1)","v":0.37166405702014105}]
["B30",{"v":0.011058318834541848,"d":"0.01106"},0.04470784387204607,{"v":0.03364952503750422,"d":"0.03"},{"$f":"var!A31","v":{"v":0.4573661930251374,"d":"0.46"}},{"$f":"trust2!A31","v":{"v":1.0746944645650909,"d":"1.07"}},{"$nulls":18},-0.94,{"v":0.981068469276211,"d":".981"},null,75,{"v":2.048918181818182,"d":"2.05"},{"v":0.3279851869962819,"d":"0.33"},"West North Central","NE",{"$nulls":6},3.042915070634092,{"$f":"FDIST(3.04291507063409,1,1)","v":0.3313790936551556}]
["B31",{"v":3.6776752421014227E-3,"d":"0.00368"},0.03832768039850147,{"v":0.03465000515640005,"d":"0.03"},{"$f":"var!A32","v":{"v":0.12625568471155796,"d":"0.13"}},{"$f":"trust2!A32","v":{"v":0.8106212137474202,"d":"0.81"}},{"$nulls":18},-0.93,{"v":0.9813617012918413,"d":".981"},null,72,{"v":0.37439090909090916,"d":"0.37"},{"v":0.727595033833169,"d":"0.73"},"New England","NH",{"$nulls":6},9.421714228524715,{"$f":"FDIST(9.42171422852472,1,1)","v":0.20049984553703742}]
["B32",{"v":0.01650518449826894,"d":"0.01651"},0.09952618939495962,{"v":0.08302100489669068,"d":"0.08"},{"$f":"var!A33","v":{"v":0.680324105011837,"d":"0.68"}},{"$f":"trust2!A33","v":{"v":1.447182067816287,"d":"1.45"}},{"$nulls":18},-0.97,{"v":0.9892048748752191,"d":".989"},null,66,{"v":1.7779454545454543,"d":"1.78"},{"v":0.3599782704025867,"d":"0.36"},"Mid-Atlantic","NJ",{"$nulls":6},5.029995569295084,{"$f":"FDIST(5.02999556929508,1,1)","v":0.26701164895922486}]
["B33",{"v":7.6906427721408765E-3,"d":"0.00769"},0.07819135584356149,{"v":0.07050071307142061,"d":"0.07"},{"$f":"var!A34","v":{"v":0.32103965241524707,"d":"0.32"}},{"$f":"trust2!A34","v":{"v":1.4309127616970672,"d":"1.43"}},{"$nulls":18},-0.94,{"v":0.9770347881152557,"d":".977"},null,67,{"v":1.1602727272727273,"d":"1.16"},{"v":0.4629045154231368,"d":"0.46"},"Mountain","NM",{"$nulls":6},9.167076817923117,{"$f":"FDIST(9.16707681792312,1,1)","v":0.2030827331411161}]
["B34",{"v":0.014291168682520915,"d":"0.01429"},0.06950811638479065,{"v":0.05521694770226974,"d":"0.06"},{"$f":"var!A35","v":{"v":0.49704678022009685,"d":"0.50"}},{"$f":"trust2!A35","v":{"v":1.112362964463159,"d":"1.11"}},{"$nulls":18},-0.97,{"v":0.9894157569494166,"d":".989"},null,67,{"v":1.3977545454545455,"d":"1.40"},{"v":0.41705686759961025,"d":"0.42"},"Mountain","NV",{"$nulls":6},3.863711144198016,{"$f":"FDIST(3.86371114419802,1,1)","v":0.2996039615088055}]
["B35",{"v":0.013889878728929486,"d":"0.01389"},0.0818954797676301,{"v":0.06800560103870062,"d":"0.07"},{"$f":"var!A36","v":{"v":0.5181018287080887,"d":"0.52"}},{"$f":"trust2!A36","v":{"v":1.2892851313669085,"d":"1.29"}},{"$nulls":18},-0.97,{"v":0.9859762492064639,"d":".986"},null,65,{"v":2.2611090909090903,"d":"2.26"},{"v":0.3066441422605807,"d":"0.31"},"Mid-Atlantic","NY",{"$nulls":6},4.896054340421295,{"$f":"FDIST(4.8960543404213,1,1)","v":0.27022134323112895}]
["B36",{"v":3.0264966296960727E-3,"d":"0.00303"},0.03473013763055707,{"v":0.031703641000861,"d":"0.03"},{"$f":"var!A37","v":{"v":0.1125685664379114,"d":"0.11"}},{"$f":"trust2!A37","v":{"v":1.009374713270051,"d":"1.01"}},{"$nulls":18},-0.93,{"v":0.9928496305371781,"d":".993"},null,71,{"v":0.16318181818181818,"d":"0.16"},{"v":0.8597108245408362,"d":"0.86"},"East North Central","OH",{"$nulls":6},10.475359757477989,{"$f":"FDIST(10.475359757478,1,1)","v":0.19077278538755302}]
["B37",{"v":0.10401134077411942,"d":"0.10401"},0.12663948633516095,{"v":0.022628145561041535,"d":"0.02"},{"$f":"var!A38","v":{"v":3.154935395332629,"d":"3.15"}},{"$f":"trust2!A38","v":{"v":0.5431757222163025,"d":"0.54"}},{"$nulls":18},-0.96,{"v":0.9770320624634006,"d":".977"},null,72,{"v":0.46949090909090907,"d":"0.47"},{"v":0.6805077825344585,"d":"0.68"},"West South Central","OK",{"$nulls":6},0.21755459926416001,{"$f":"FDIST(0.21755459926416,1,1)","v":0.7221595654984546}]
["B38",{"v":0.1558785064783927,"d":"0.15588"},0.1826801805006562,{"v":0.026801674022263522,"d":"0.03"},{"$f":"var!A39","v":{"v":4.549914903100174,"d":"4.55"}},{"$f":"trust2!A39","v":{"v":0.3861310621331479,"d":"0.39"}},{"$nulls":18},-0.93,{"v":0.9888599293348016,"d":".989"},null,70,{"v":0.1090818181818182,"d":"0.11"},{"v":0.9016467348093017,"d":"0.90"},"Pacific","OR",{"$nulls":6},0.17193950999253815,{"$f":"FDIST(0.171939509992538,1,1)","v":0.7497596797554513}]
["B39",{"v":0.051487973465999815,"d":"0.05149"},0.07503802054704556,{"v":0.023550047081045744,"d":"0.02"},{"$f":"var!A40","v":{"v":1.534549906298702,"d":"1.53"}},{"$f":"trust2!A40","v":{"v":0.5629973222553226,"d":"0.56"}},{"$nulls":18},-0.93,{"v":0.9883158683643912,"d":".988"},null,70,{"v":0.18813636363636366,"d":"0.19"},{"v":0.8416542331382226,"d":"0.84"},"Mid-Atlantic","PA",{"$nulls":6},0.45738927939350854,{"$f":"FDIST(0.457389279393509,1,1)","v":0.62143655708915}]
["B40",{"v":1.5099462315986403E-3,"d":"0.00151"},0.031355330515694,{"v":0.02984538428409536,"d":"0.03"},{"$f":"var!A41","v":{"v":0.05827640071708343,"d":"0.06"}},{"$f":"trust2!A41","v":{"v":1.1014948991191724,"d":"1.10"}},{"$nulls":18},-0.94,{"v":0.9806912987242867,"d":".981"},null,70,{"v":0.24228181818181815,"d":"0.24"},{"v":0.8049703258666238,"d":"0.80"},"New England","RI",{"$nulls":6},19.76585898194326,{"$f":"FDIST(19.7658589819433,1,1)","v":0.14084909196919135}]
["B41",{"v":2.5457595281237933E-3,"d":"0.00255"},0.033376391093287036,{"v":0.030830631565163243,"d":"0.03"},{"$f":"var!A42","v":{"v":0.1039767897213552,"d":"0.10"}},{"$f":"trust2!A42","v":{"v":1.224103209713228,"d":"1.22"}},{"$nulls":18},-0.96,{"v":0.9799283032203562,"d":".980"},null,72,{"v":0.3125727272727273,"d":"0.31"},{"v":0.7618625461446292,"d":"0.76"},"South Atlantic","SC",{"$nulls":6},12.110582804293852,{"$f":"FDIST(12.1105828042939,1,1)","v":0.1781358285612414}]
["B42",{"v":0.005540515018557835,"d":"0.00554"},0.03658633137144149,{"v":0.031045816352883653,"d":"0.03"},{"$f":"var!A43","v":{"v":0.1928058423616563,"d":"0.19"}},{"$f":"trust2!A43","v":{"v":0.7127342154803961,"d":"0.71"}},{"$nulls":18},-0.91,{"v":0.9638860259336051,"d":".964"},null,75,{"v":1.952109090909091,"d":"1.95"},{"v":0.33874086939383863,"d":"0.34"},"West North Central","SD",{"$nulls":6},5.603417055796503,{"$f":"FDIST(5.6034170557965,1,1)","v":0.2544615813512041}]
["B43",{"v":2.5127105609369983E-3,"d":"0.00251"},0.03125837539351127,{"v":0.02874566483257427,"d":"0.03"},{"$f":"var!A44","v":{"v":0.08503237011407917,"d":"0.09"}},{"$f":"trust2!A44","v":{"v":0.8006624685351489,"d":"0.80"}},{"$nulls":18},-0.96,{"v":0.9793894475014772,"d":".979"},null,71,{"v":0.23915454545454545,"d":"0.24"},{"v":0.8070018414314746,"d":"0.81"},"East South Central","TN",{"$nulls":6},11.440101888159738,{"$f":"FDIST(11.4401018881597,1,1)","v":0.18300634552634956}]
["B44",{"v":3.8879946644100063E-3,"d":"0.00389"},0.057591814698769436,{"v":0.05370382003435943,"d":"0.05"},{"$f":"var!A45","v":{"v":0.13211876950833384,"d":"0.13"}},{"$f":"trust2!A45","v":{"v":0.8112580123627746,"d":"0.81"}},{"$nulls":18},-0.96,{"v":0.9778568907405903,"d":".978"},null,73,{"v":0.5150363636363636,"d":"0.52"},{"v":0.6600501638124497,"d":"0.66"},"West South Central","TX",{"$nulls":6},13.812729869707487,{"$f":"FDIST(13.8127298697075,1,1)","v":0.16733035792290896}]
["B45",{"v":0.010702617180684063,"d":"0.01070"},0.05416910463112645,{"v":0.04346648745044239,"d":"0.04"},{"$f":"var!A46","v":{"v":0.5212373831893057,"d":"0.52"}},{"$f":"trust2!A46","v":{"v":1.3320517018435598,"d":"1.33"}},{"$nulls":18},-0.95,{"v":0.9790125340097087,"d":".979"},null,73,{"v":0.8942999999999999,"d":"0.89"},{"v":0.5278994879374967,"d":"0.53"},"Mountain","UT",{"$nulls":6},4.061295168894774,{"$f":"FDIST(4.06129516889477,1,1)","v":0.2932353696096377}]
["B46",{"v":0.012680846265195885,"d":"0.01268"},0.013455901571399635,{"v":0.00077505530620375,"d":"0.00"},{"$f":"var!A47","v":{"v":0.40259596880481735,"d":"0.40"}},{"$f":"trust2!A47","v":{"v":0.8477903324034902,"d":"0.85"}},{"$nulls":18},-0.95,{"v":0.9972869150931828,"d":".997"},null,69,{"v":0.1645727272727273,"d":"0.16"},{"v":0.858684027696463,"d":"0.86"},"South Atlantic","VA",{"$nulls":6},0.06112015633617316,{"$f":"FDIST(0.0611201563361732,1,1)","v":0.8457055766038362}]
["B47",{"v":0.00905967215557784,"d":"0.00906"},0.011702245990763917,{"v":2.642573835186077E-3,"d":"0.00"},{"$f":"var!A48","v":{"v":0.37626214013306636,"d":"0.38"}},{"$f":"trust2!A48","v":{"v":1.1107402046506494,"d":"1.11"}},{"$nulls":18},-0.88,{"v":0.9336070900519076,"d":".934"},null,63,{"v":6.727227272727273,"d":"6.73"},{"v":0.12941252595603503,"d":"0.13"},"South Atlantic","VI",{"$nulls":6},0.2916853711487896,{"$f":"FDIST(0.29168537114879,1,1)","v":0.6847494168180271}]
["B48",{"v":0.009786333579457776,"d":"0.00979"},0.03038661525144722,{"v":0.02060028167198944,"d":"0.02"},{"$f":"var!A49","v":{"v":0.43147704397917225,"d":"0.43"}},{"$f":"trust2!A49","v":{"v":1.075026116392888,"d":"1.08"}},{"$nulls":18},-0.93,{"v":0.9671232130589031,"d":".967"},null,72,{"v":0.5599,"d":"0.56"},{"v":0.6410667350471184,"d":"0.64"},"New England","VT",{"$nulls":6},2.105005056769261,{"$f":"FDIST(2.10500505676926,1,1)","v":0.3841816367733384}]
["B49",{"v":1.5627592236926264E-3,"d":"0.00156"},0.023652677683851465,{"v":0.022089918460158838,"d":"0.02"},{"$f":"var!A50","v":{"v":0.06169395891085053,"d":"0.06"}},{"$f":"trust2!A50","v":{"v":0.9947310821866281,"d":"0.99"}},{"$nulls":18},-0.91,{"v":0.9730558226727093,"d":".973"},null,69,{"v":0.4090727272727273,"d":"0.41"},{"v":0.7096865766009883,"d":"0.71"},"Pacific","WA",{"$nulls":6},14.135202739653531,{"$f":"FDIST(14.1352027396535,1,1)","v":0.16549644116191936}]
["B50",{"v":0.029113527245361738,"d":"0.02911"},0.07565531525969206,{"v":0.04654178801433032,"d":"0.05"},{"$f":"var!A51","v":{"v":1.2487056200035063,"d":"1.25"}},{"$f":"trust2!A51","v":{"v":1.1919404057633827,"d":"1.19"}},{"$nulls":18},-0.96,{"v":0.9915888320473162,"d":".992"},null,74,{"v":1.0677727272727273,"d":"1.07"},{"v":0.48361214306126477,"d":"0.48"},"East North Central","WI",{"$nulls":6},1.5986310288714738,{"$f":"FDIST(1.59863102887147,1,1)","v":0.4260083184760777}]
["B51",{"v":9.625353784079459E-3,"d":"0.00963"},0.05184927006595123,{"v":0.042223916281871776,"d":"0.04"},{"$f":"var!A52","v":{"v":0.3299733908459838,"d":"0.33"}},{"$f":"trust2!A52","v":{"v":0.6673939959076504,"d":"0.67"}},{"$nulls":18},-0.96,{"v":0.9852120655043122,"d":".985"},null,69,{"v":0.3506272727272727,"d":"0.35"},{"v":0.7403967180232753,"d":"0.74"},"South Atlantic","WV",{"$nulls":6},4.386739150483075,{"$f":"FDIST(4.38673915048308,1,1)","v":0.2835800426029387}]
["B52",{"v":0.018595176468368474,"d":"0.01860"},0.08037325107333303,{"v":0.06177807460496455,"d":"0.06"},{"$f":"var!A53","v":{"v":0.689314516061363,"d":"0.69"}},{"$f":"trust2!A53","v":{"v":1.172766136851044,"d":"1.17"}},{"$nulls":18},-0.91,{"v":0.9806504722660823,"d":".981"},null,71,{"v":0.29768181818181816,"d":"0.30"},{"v":0.7706049248660198,"d":"0.77"},"Mountain","WY",{"$nulls":6},3.3222634219176577,{"$f":"FDIST(3.32226342191766,1,1)","v":0.31945204306425945}]
["B53",{"v":0.02084722051250673,"d":"0.02085"},0.018470530510468687,{"v":-0.002376690002038044,"d":"-0.00"},{"$f":"var!A54","v":{"v":0.7890514247490986,"d":"0.79"}},{"$f":"trust2!A54","v":{"v":0.8850091550559024,"d":"0.89"}},{"$nulls":18},-0.95,{"v":0.9995924525583618,"d":"1.000"},null,71,{"v":0.011999999999999999,"d":"0.01"},{"v":0.9881422924901185,"d":"0.99"},"US","US",{"$nulls":6},-0.11400512603645233,{"$f":"FDIST(-0.114005126036452,1,1)","v":{"$error":"#NUM!"}}]
["B54",{"v":0.00903191478743495,"d":"0.00903"},0.08312749133922906,{"v":0.0740955765517941,"d":"0.07"},{"$f":"var!A55","v":{"v":0.28332940764190584,"d":"0.28"}},{"$f":"trust2!A55","v":{"v":0.5472073404750945,"d":"0.55"}},{"$nulls":32},8.203750621615102,{"$f":"FDIST(8.2037506216151,1,1)","v":0.21384331106232982}]
["B55",{"v":0.020641789518333203,"d":"0.02064"},0.05039141855907833,{"v":0.02974962904074513,"d":"0.03"},{"$f":"var!A56","v":{"v":0.7311199172089237,"d":"0.73"}},{"$f":"trust2!A56","v":{"v":0.7650674991108039,"d":"0.77"}},{"$nulls":32},1.441233039137557,{"$f":"FDIST(1.44123303913756,1,1)","v":0.4421501391440529}]
["B56",{"v":0.03102024299031443,"d":"0.03102"},0.12739962500187624,{"v":0.0963793820115618,"d":"0.10"},{"$f":"var!A57","v":{"v":1.3152559261703791,"d":"1.32"}},{"$f":"trust2!A57","v":{"v":1.4883785864706727,"d":"1.49"}},{"$nulls":32},3.1069834637225346,{"$f":"FDIST(3.10698346372253,1,1)","v":0.32852496502509043}]
["B57",{"v":0.000730440861104906,"d":"0.00073"},0.024171226830347888,{"v":0.023440785969242983,"d":"0.02"},{"$f":"var!A58","v":{"v":0.029008136446502186,"d":"0.03"}},{"$f":"trust2!A58","v":{"v":1.0469696955709509,"d":"1.05"}},{"$nulls":32},32.0912851641201,{"$f":"FDIST(32.0912851641201,1,1)","v":0.11123342516008823}]
["B58",{"v":0.03565661776220634,"d":"0.03566"},0.11069370215353902,{"v":0.07503708439133268,"d":"0.08"},{"$f":"var!A59","v":{"v":1.3273156966713788,"d":"1.33"}},{"$f":"trust2!A59","v":{"v":1.3674659193320347,"d":"1.37"}},{"$nulls":32},2.1044364020097,{"$f":"FDIST(2.1044364020097,1,1)","v":0.3842218231664531}]
["B59",{"v":0.12432866346953511,"d":"0.12433"},0.13301748887483242,{"v":0.008688825405297307,"d":"0.01"},{"$f":"var!A60","v":{"v":5.559985345912676,"d":"5.56"}},{"$f":"trust2!A60","v":{"v":1.2839967099119989,"d":"1.28"}},{"$nulls":32},0.06988593911352046,{"$f":"FDIST(0.0698859391135205,1,1)","v":0.8354674325962429}]
["B60",{"v":0.022433170299886174,"d":"0.02243"},0.14985100627832418,{"v":0.127417835978438,"d":"0.13"},{"$f":"var!A61","v":{"v":1.0503247783700889,"d":"1.05"}},{"$f":"trust2!A61","v":{"v":1.8375608516021993,"d":"1.84"}},{"$nulls":32},5.679885378442677,{"$f":"FDIST(5.67988537844268,1,1)","v":0.2529185930815513}]
["B61",{"v":0.01839290821124054,"d":"0.01839"},0.08017589050850772,{"v":0.06178298229726718,"d":"0.06"},{"$f":"var!A62","v":{"v":0.6691311564063477,"d":"0.67"}},{"$f":"trust2!A62","v":{"v":1.3615195833521427,"d":"1.36"}},{"$nulls":32},3.3590654391190555,{"$f":"FDIST(3.35906543911906,1,1)","v":0.31797546962818024}]
["B62",{"v":0.17963289905557972,"d":"0.17963"},0.4484783412858632,{"v":0.2688454422302835,"d":"0.27"},{"$f":"var!A63","v":{"v":5.185284136740546,"d":"5.19"}},{"$f":"trust2!A63","v":{"v":-0.06040087073149826,"d":"-0.06"}},{"$nulls":32},1.4966381082960798,{"$f":"FDIST(1.49663810829608,1,1)","v":0.4362557154127649}]
["B63",{"v":0.010648227789819878,"d":"0.01065"},0.022895185366559656,{"v":0.012246957576739778,"d":"0.01"},{"$f":"var!A64","v":{"v":0.34835872778498955,"d":"0.35"}},{"$f":"trust2!A64","v":{"v":0.808421778035841,"d":"0.81"}},{"$nulls":32},1.1501404570296994,{"$f":"FDIST(1.1501404570297,1,1)","v":0.4777548879478499}]
["B64",{"v":0.0698659140082273,"d":"0.06987"},0.28823817929450546,{"v":0.21837226528627818,"d":"0.22"},{"$f":"var!A65","v":{"v":4.767462049277459,"d":"4.77"}},{"$f":"trust2!A65","v":{"v":2.2059535386245703,"d":"2.21"}},{"$nulls":32},3.1255909034634977,{"$f":"FDIST(3.1255909034635,1,1)","v":0.3277098590874393}]
["B65",{"v":0.005921369687435522,"d":"0.00592"},0.057074114191301456,{"v":0.051152744503865935,"d":"0.05"},{"$f":"var!A66","v":{"v":0.22550362005142324,"d":"0.23"}},{"$f":"trust2!A66","v":{"v":1.4075824996494697,"d":"1.41"}},{"$nulls":32},8.638667606315188,{"$f":"FDIST(8.63866760631519,1,1)","v":0.20877784818056067}]
["B66",{"v":0.0437983122243477,"d":"0.04380"},0.269589773210495,{"v":0.22579146098614727,"d":"0.23"},{"$f":"var!A67","v":{"v":3.0723105568506757,"d":"3.07"}},{"$f":"trust2!A67","v":{"v":2.376023331662253,"d":"2.38"}},{"$nulls":32},5.1552548378937,{"$f":"FDIST(5.1552548378937,1,1)","v":0.26411151980765274}]
["B67",{"v":0.011997113676260437,"d":"0.01200"},0.06417359705332053,{"v":0.05217648337706009,"d":"0.05"},{"$f":"var!A68","v":{"v":0.47410400714668866,"d":"0.47"}},{"$f":"trust2!A68","v":{"v":1.2197263747274443,"d":"1.22"}},{"$nulls":32},4.349086354020759,{"$f":"FDIST(4.34908635402076,1,1)","v":0.284648380960462}]
["B68",{"v":0.016849502391470254,"d":"0.01685"},0.06309649968119319,{"v":0.04624699728972293,"d":"0.05"},{"$f":"var!A69","v":{"v":0.5385185883660322,"d":"0.54"}},{"$f":"trust2!A69","v":{"v":1.0152434672211184,"d":"1.02"}},{"$nulls":32},2.7447099751227437,{"$f":"FDIST(2.74470997512274,1,1)","v":0.3457258794239536}]
["B69",{"v":0.0060034697739461,"d":"0.00600"},0.04987185469404061,{"v":0.04386838492009451,"d":"0.04"},{"$f":"var!A70","v":{"v":0.20949263305683044,"d":"0.21"}},{"$f":"trust2!A70","v":{"v":0.8645462153754336,"d":"0.86"}},{"$nulls":32},7.307171780971537,{"$f":"FDIST(7.30717178097154,1,1)","v":0.22556882659622043}]
["B70",{"v":0.012229013483343893,"d":"0.01223"},0.0829128116971368,{"v":0.0706837982137929,"d":"0.07"},{"$f":"var!A71","v":{"v":0.3797793475132171,"d":"0.38"}},{"$f":"trust2!A71","v":{"v":0.49062154673352243,"d":"0.49"}},{"$nulls":32},5.780008200176191,{"$f":"FDIST(5.78000820017619,1,1)","v":0.25094019746210766}]
["B71",{"v":0.00900486635847991,"d":"0.00900"},0.022993436824268285,{"v":0.013988570465788375,"d":"0.01"},{"$f":"var!A72","v":{"v":0.3583321443745436,"d":"0.36"}},{"$f":"trust2!A72","v":{"v":0.9462025279712573,"d":"0.95"}}," ",{"$nulls":31},1.5534456491533932,{"$f":"FDIST(1.55344564915339,1,1)","v":0.4304561030599629}]
["B72",{"v":1.2444354413816893E-3,"d":"0.00124"},0.020951509284613267,{"v":0.019707073843231577,"d":"0.02"},{"$f":"var!A73","v":{"v":0.051733712086899815,"d":"0.05"}},{"$f":"trust2!A73","v":{"v":1.146645141148366,"d":"1.15"}},{"$nulls":32},15.836156049486126,{"$f":"FDIST(15.8361560494861,1,1)","v":0.15673092503612773}]
["B73",{"v":0.01815057605915185,"d":"0.01815"},0.11964502212444443,{"v":0.10149444606529258,"d":"0.10"},{"$f":"var!A74","v":{"v":0.8204839262056339,"d":"0.82"}},{"$f":"trust2!A74","v":{"v":1.5789050882186244,"d":"1.58"}},{"$nulls":32},5.591803022368385,{"$f":"FDIST(5.59180302236839,1,1)","v":0.25469841612740046}]
["B74",{"v":5.0061751991387169E-4,"d":"0.00050"},0.02774092115162865,{"v":0.027240303631714778,"d":"0.03"},{"$f":"var!A75","v":{"v":0.01860706926367021,"d":"0.02"}},{"$f":"trust2!A75","v":{"v":1.0918094707806074,"d":"1.09"}},{"$nulls":32},54.4134045416575,{"$f":"FDIST(54.4134045416575,1,1)","v":0.08578032001522647}]
["B75",{"v":0.04713378465797061,"d":"0.04713"},0.16303833383475197,{"v":0.11590454917678136,"d":"0.12"},{"$f":"var!A76","v":{"v":2.0531981946457667,"d":"2.05"}},{"$f":"trust2!A76","v":{"v":1.5740673965772978,"d":"1.57"}},{"$nulls":32},2.459054582988621,{"$f":"FDIST(2.45905458298862,1,1)","v":0.3613958635312715}]
["B76",{"v":0.01925885189916811,"d":"0.01926"},0.0794013092505243,{"v":0.06014245735135619,"d":"0.06"},{"$f":"var!A77","v":{"v":0.710923234601065,"d":"0.71"}},{"$f":"trust2!A77","v":{"v":1.1548192164041773,"d":"1.15"}},{"$nulls":32},3.1228474919605183,{"$f":"FDIST(3.12284749196052,1,1)","v":0.327829651312515}]
["B77",{"v":0.007157415930479345,"d":"0.00716"},0.05435448085665127,{"v":0.04719706492617192,"d":"0.05"},{"$f":"var!A78","v":{"v":0.22965588463373207,"d":"0.23"}},{"$f":"trust2!A78","v":{"v":0.8835289764406602,"d":"0.88"}},{"$nulls":32},6.59414869620565,{"$f":"FDIST(6.59414869620565,1,1)","v":0.23641155307595932}]
["B78",{"v":0.1429987034598228,"d":"0.14300"},0.2333272530675738,{"v":0.090328549607751,"d":"0.09"},{"$f":"var!A79","v":{"v":4.805329847607809,"d":"4.81"}},{"$f":"trust2!A79","v":{"v":0.5583810167619204,"d":"0.56"}},{"$nulls":32},0.6316739062821635,{"$f":"FDIST(0.631673906282163,1,1)","v":0.5724783845003181}]
["B79",{"v":0.04070478972090692,"d":"0.04070"},0.12347823557121877,{"v":0.08277344585031185,"d":"0.08"},{"$f":"var!A80","v":{"v":1.1752045988696278,"d":"1.18"}},{"$f":"trust2!A80","v":{"v":0.3904412506235353,"d":"0.39"}},{"$nulls":32},2.0335062880277572,{"$f":"FDIST(2.03350628802776,1,1)","v":0.38933699631872787}]
["B80",{"v":0.012688201173684098,"d":"0.01269"},0.07701976751423051,{"v":0.0643315663405464,"d":"0.06"},{"$f":"var!A81","v":{"v":0.4902026271791679,"d":"0.49"}},{"$f":"trust2!A81","v":{"v":1.2710438511269417,"d":"1.27"}},{"$nulls":32},5.070188079455501,{"$f":"FDIST(5.0701880794555,1,1)","v":0.2660706544969193}]
[{"$nulls":38},30.590447216695615,{"$f":"FDIST(30.5904472166956,1,1)","v":0.11387295211502045}]
[{"$nulls":38},152.07631698957613,{"$f":"FDIST(152.076316989576,1,1)","v":0.05151101520072665}]
[{"$nulls":38},369.97720172384953,{"$f":"FDIST(369.97720172385,1,1)","v":0.03306753473627578}]
[{"$nulls":38},588265.9498419422,{"$f":"FDIST(588265.949841942,1,1)","v":8.3002853183145443E-4}]
[{"$nulls":38},416.24322941833094,{"$f":"FDIST(416.243229418331,1,1)","v":0.031178779044857042}]
[{"$nulls":38},197.75704984733088,{"$f":"FDIST(197.757049847331,1,1)","v":0.04519430384211692}]
[{"$nulls":38},117.7327534149489,{"$f":"FDIST(117.732753414949,1,1)","v":0.05850680325804378}]
[{"$nulls":38},401.27693819096044,{"$f":"FDIST(401.27693819096,1,1)","v":0.03175394227970576}]
[{"$nulls":38},1120.1960491277753,{"$f":"FDIST(1120.19604912778,1,1)","v":0.019015332460817817}]
[{"$nulls":38},14968.267853250198,{"$f":"FDIST(14968.2678532502,1,1)","v":0.005203369640857933}]
[{"$nulls":38},942.8185887232913,{"$f":"FDIST(942.818588723291,1,1)","v":0.02072586096680613}]
[{"$nulls":38},143326.9525759815,{"$f":"FDIST(143326.952575982,1,1)","v":1.6815708855757374E-3}]
[{"$nulls":38},805.7100760407575,{"$f":"FDIST(805.710076040757,1,1)","v":0.022418737325807302}]
[{"$nulls":38},202.09613135527619,{"$f":"FDIST(202.096131355276,1,1)","v":0.04470811275341918}]
[{"$nulls":38},697.2887392075015,{"$f":"FDIST(697.288739207502,1,1)","v":0.024097185175788783}]
[{"$nulls":38},18841.487147795284,{"$f":"FDIST(18841.4871477953,1,1)","v":0.004637830268418689}]
[{"$nulls":38},801.5502062950067,{"$f":"FDIST(801.550206295007,1,1)","v":0.022476788000151366}]
[{"$nulls":38},421.5495127165496,{"$f":"FDIST(421.54951271655,1,1)","v":0.030982236762886726}]
[{"$nulls":38},992.3771811555928,{"$f":"FDIST(992.377181155593,1,1)","v":0.020202072486877023}]
[{"$nulls":38},4265.78780878459,{"$f":"FDIST(4265.78780878459,1,1)","v":0.009746452393108241}]
[{"$nulls":38},353.04050829721956,{"$f":"FDIST(353.04050829722,1,1)","v":0.03384997123295877}]
[{"$nulls":38},2107.429079993877,{"$f":"FDIST(2107.42907999388,1,1)","v":0.013865481643841533}]
[{"$nulls":38},310.73078567418173,{"$f":"FDIST(310.730785674182,1,1)","v":0.03607636272039303}]
[{"$nulls":38},1.6704096449580686E+27,{"$f":"FDIST(1.67040964495807E+27,1,1)","v":1.5576455133731856E-14}]
[{"$nulls":38},1.6704096449580686E+27,{"$f":"FDIST(1.67040964495807E+27,1,1)","v":1.5576455133731856E-14}]
[{"$nulls":38},1.6704096449580686E+27,{"$f":"FDIST(1.67040964495807E+27,1,1)","v":1.5576455133731856E-14}]
[{"$nulls":38},1.6704096449580686E+27,{"$f":"FDIST(1.67040964495807E+27,1,1)","v":1.5576455133731856E-14}]
[{"$nulls":38},1.855996628148505e+24,{"$f":"FDIST(1.8559966281485E+24,1,1)","v":4.672954275714466e-13}]
[{"$nulls":38},6.43268270873322e+22,{"$f":"FDIST(6.43268270873322E+22,1,1)","v":2.5100597391513027E-12}]
[{"$nulls":38},8.116294948595581e+19,{"$f":"FDIST(81162949485955800000,1,1)","v":7.06644873211694e-11}]
[{"$nulls":38},8.116294948595581e+19,{"$f":"FDIST(81162949485955800000,1,1)","v":7.06644873211694e-11}]
[{"$nulls":38},8.116294948595581e+19,{"$f":"FDIST(81162949485955800000,1,1)","v":7.06644873211694e-11}]
[{"$nulls":38},1.04212837544658E+17,{"$f":"FDIST(104212837544658000,1,1)","v":1.9720572216711831E-9}]
[{"$nulls":38},1.04212837544658E+17,{"$f":"FDIST(104212837544658000,1,1)","v":1.9720572216711831E-9}]
[{"$nulls":38},126328146300939.47,{"$f":"FDIST(126328146300939,1,1)","v":5.6640889009922175E-8}]
[{"$nulls":38},129782959022.67854,{"$f":"FDIST(129782959022.679,1,1)","v":1.7671413413491448E-6}]
[{"$nulls":38},129782959022.67854,{"$f":"FDIST(129782959022.679,1,1)","v":1.7671413413491448E-6}]
[{"$nulls":38},3722316966.8663836,{"$f":"FDIST(3722316966.86638,1,1)","v":1.0434543333748194E-5}]
[{"$nulls":38},95874396.9605167,{"$f":"FDIST(95874396.9605167,1,1)","v":6.5017280298366431E-5}]
[{"$nulls":38},95874396.9605167,{"$f":"FDIST(95874396.9605167,1,1)","v":6.5017280298366431E-5}]
[{"$nulls":38},95874396.9605167,{"$f":"FDIST(95874396.9605167,1,1)","v":6.5017280298366431E-5}]
[{"$nulls":38},51675.9875782141,{"$f":"FDIST(51675.9875782141,1,1)","v":2.8004829247842223E-3}]
[{"$nulls":38},51675.9875782141,{"$f":"FDIST(51675.9875782141,1,1)","v":2.8004829247842223E-3}]
[{"$nulls":38},51675.9875782141,{"$f":"FDIST(51675.9875782141,1,1)","v":2.8004829247842223E-3}]
[{"$nulls":38},51675.9875782141,{"$f":"FDIST(51675.9875782141,1,1)","v":2.8004829247842223E-3}]
[{"$nulls":38},109282.43125755496,{"$f":"FDIST(109282.431257555,1,1)","v":1.9257664844760797E-3}]
[{"$nulls":38},9001.472248958,{"$f":"FDIST(9001.472248958,1,1)","v":6.7097643518463585E-3}]

{"sheet":"data","index":2,"n_rows":81,"n_cols":7,"rows_kept":81}
[{"$f":"STDEV(G2:G81)","v":4.14854716229916},"b","c","e","f","g","h"]
[0.17,57.747252747252745,70.07692307692307,56.92307692307692,59.80769230769231,58.7179487179487,56.26373626373627]
[0.93,64.82142857142857,71,64.375,63.4375,59.166666666666664,57.142857142857146]
[0.26,56.42857142857143,65,52.25,48.5,48.333333333333336,56.42857142857143]
[0.45,46.632653061224495,64.14285714285715,35,51.07142857142858,45.47619047619048,52.44897959183673]
[0.12,52,65.4,45.5,49.5,50.666666666666664,56.142857142857146]
[0.19,51.836734693877546,58.505494505494504,49.917582417582416,49.46428571428572,51.135531135531124,53.34379905808477]
[0.24,57.163265306122454,71,55.89285714285714,61.035714285714285,55.857142857142854,59.06122448979592]
[0.12,49.23469387755102,63.07142857142857,50.401785714285715,51.205357142857146,49.4047619047619,56.275510204081634]
[-0.64,52.329192546583855,67.21739130434783,46.57608695652174,50.163043478260875,60.072463768115945,58.29192546583851]
[0.91,67.71428571428571,67.2,64.5,61,52.111111111111114,55]
[{"v":0.8,"d":"0.80"},56.42857142857143,65,50,50,31.666666666666668,47.857142857142854]
[0.31,55.54621848739497,67.64705882352942,53.75,55.514705882352935,51.568627450980394,55.168067226890756]
[-0.23,50,70.0625,49.765625,52.34375,54.166666666666664,58.973214285714285]
[0.96,62.97252747252747,62.738461538461536,61.01923076923077,62.51923076923077,50.34615384615384,51.120879120879124]
[0.79,65.41033434650454,61.87234042553191,63.404255319148945,64.36170212765958,46.52482269503546,46.079027355623104]
[0.82,61.18012422360248,59.1304347826087,60.76086956521739,62.71739130434783,41.231884057971016,46.5527950310559]
[0.73,70.16806722689076,68.52941176470588,66.10294117647058,64.77941176470588,44.01960784313725,49.2436974789916]
[0.77,69.6938775510204,70.64285714285714,70.08928571428571,69.73214285714286,51.388888888888886,49.54081632653062]
[0.83,64.0700808625337,58.660377358490564,61.0377358490566,60.68396226415094,46.41509433962264,47.16981132075471]
[0.77,66.30252100840336,60.058823529411754,61.98529411764706,62.72058823529412,43.627450980392155,44.6218487394958]
[0.73,70.25974025974025,69.5,69.0340909090909,70.625,47.80303030303029,49.48051948051948]
[0.86,65.26373626373626,66.56923076923076,64.9423076923077,65.57692307692308,48.97435897435898,49.505494505494504]
[0.89,66.52509652509652,65.1891891891892,64.45945945945947,65.74324324324324,49.609609609609606,53.745173745173744]
[0.78,66.62561576354679,66.39655172413792,65.19396551724138,65.9051724137931,47.27011494252873,46.453201970443345]
[0.83,63.24912891986063,61.5609756097561,63.170731707317074,64.3140243902439,46.34146341463415,51.045296167247386]
[-0.15,47.41596638655462,56.97058823529412,50.772058823529406,50.66176470588235,48.87254901960784,59.07563025210084]
[0.79,64.375,60.75,62.34375,58.59375,42.986111111111114,51.339285714285715]
[0.81,65.03726708074534,63.617391304347834,64.86956521739131,65.84782608695653,46.24637681159421,52.27329192546584]
[{"v":0.7,"d":"0.70"},68.21428571428571,64.625,69.53125,71.40625,47.708333333333336,50.357142857142854]
[0.75,66.07142857142857,59.95454545454546,63.97727272727273,65.3409090909091,48.78787878787879,51.36363636363637]
[{"v":0.9,"d":"0.90"},58.91428571428572,58.88,57.95,59.6,44.666666666666664,50.25714285714286]
[0.83,68.31168831168831,71.81818181818181,70.11363636363636,70.11363636363636,53.636363636363626,52.142857142857146]
[{"v":0.9,"d":"0.90"},66.80194805194806,70.5909090909091,68.57954545454545,69.6875,54.393939393939405,54.87012987012987]
[0.79,65.94430992736078,65.2542372881356,65.76271186440678,65.82627118644068,45.67796610169492,50.39951573849879]
[0.83,68.40336134453783,70.11764705882354,66.32352941176471,67.42647058823529,48.333333333333336,53.27731092436976]
[0.91,63.392857142857146,62.75,63.125,60.78125,50,49.464285714285715]
[0.18,47.42857142857143,65.6,38.75,43.25,52,55.142857142857146]
[0.15,35.714285714285715,51,35,55,49.44444444444444,58.57142857142857]
[0.31,48.660714285714285,60.125,43.4375,48.59375,50.833333333333336,52.67857142857143]
[0.95,64.86175115207374,64.2258064516129,62.21774193548387,62.82258064516129,52.52688172043011,51.244239631336406]
[0.92,65.06912442396313,64.85483870967741,65.06048387096774,64.51612903225806,55.86021505376344,53.14516129032258]
[0.85,58.38235294117647,55.73529411764706,55.018382352941174,55.51470588235294,47.30392156862746,48.298319327731086]
[0.92,59.882352941176464,59.423529411764704,56.970588235294116,56.22058823529412,49.31372549019608,47.45378151260504]
[0.93,62.857142857142854,62.6,55.25,58.625,45.5,45.5]
[{"v":0.8,"d":"0.80"},70.35714285714286,62.6,66.125,67.25,52.833333333333336,58.142857142857146]
[0.06,58.57142857142857,60.15384615384615,54.03846153846153,55.19230769230769,51.41025641025641,54.615384615384606]
[0.23,61.3265306122449,60.28571428571429,63.92857142857143,61.7857142857143,56.19047619047619,55.20408163265306]
[0.68,65.42857142857143,58.85,64.25,62.9375,50.416666666666664,53.642857142857146]
[0.93,62.648809523809526,62,59.84375,61.5625,51.736111111111114,50.357142857142854]
[0.62,69.28571428571429,59,68.75,68.75,50,50]
[0.81,53.75,54.5,57.5,57.96875,46.875,44.910714285714285]
[0.77,70,67,62.5,67.5,50,47.142857142857146]
[-0.13,61.785714285714285,53.75,55.625,61.25,50.416666666666664,54.82142857142857]
[0.89,58.57142857142857,54,51.25,51.25,46.111111111111114,41.42857142857143]
[0.59,58.035714285714285,53,62.1875,58.4375,42.916666666666664,51.07142857142857]
[0.76,73.57142857142857,71,72.5,68.75,53.333333333333336,50]
[0.97,63.07142857142857,64.1,61.8125,60.125,51.833333333333336,52.035714285714285]
[0.68,67.92207792207792,71,68.4090909090909,70.11363636363636,58.48484848484847,44.15584415584415]
[0.07,60.714285714285715,80,65,42.5,66.66666666666667,58.57142857142857]
[0.85,72.5,73.18181818181819,72.1590909090909,73.01136363636364,67.27272727272728,53.70129870129871]
[0.77,68.57142857142857,70,67.5,66.25,59.44444444444444,47.857142857142854]
[{"v":0.6,"d":"0.60"},41.42857142857143,41,16.25,42.5,48.333333333333336,43.57142857142857]
[0.53,60.40816326530613,59.642857142857146,55.35714285714286,52.41071428571428,50.238095238095234,51.98979591836735]
[0.76,77.85714285714286,80,80,80,58.333333333333336,54.285714285714285]
[{"v":0.9,"d":"0.90"},65.77142857142857,69.32,68,65.75,60.46666666666667,53.857142857142854]
[0.84,77.11822660098521,78.03448275862067,76.76724137931033,77.80172413793103,72.87356321839079,54.8768472906404]
[0.81,68.21428571428571,64.8125,64.296875,68.984375,49.6875,52.142857142857146]
[0.73,65.40178571428571,65.75,60.078125,62.890625,53.4375,42.5]
[0.88,61.88311688311688,59.95454545454545,58.35227272727273,62.61363636363636,44.3939393939394,48.441558441558435]
[0.85,54.142857142857146,51,50.625,50.625,42.72222222222222,47.285714285714285]
[0.61,63.31632653061225,57.5,60.44642857142858,60.44642857142857,52.61904761904762,49.23469387755102]
[0.94,63.019480519480524,64.54545454545455,63.29545454545455,61.93181818181818,53.76262626262626,55.32467532467532]
[0.85,71.27551020408164,73.78571428571429,72.5,68.75,54.166666666666664,55.05102040816326]
[0.98,64.03571428571429,65.9,60.5,61.4375,51.25,53.910714285714285]
[0.71,73.35714285714286,74.1,73,72.375,55.22222222222222,47.142857142857146]
[0.76,67.72727272727272,71,64.6590909090909,60.56818181818181,44.54545454545454,54.090909090909086]
[0.87,62.38095238095237,61.33333333333333,59.58333333333333,61.666666666666664,42.77777777777778,49.761904761904766]
[0.39,33.92857142857143,78.5,53.75,48.125,41.666666666666664,47.857142857142854]
[0.67,50.714285714285715,53.5,45.625,41.25,43.05555555555556,51.07142857142857]
[0.84,69.01785714285714,70.625,66.40625,64.53125,52.083333333333336,49.732142857142854]

{"sheet":"output","index":3,"n_rows":21,"n_cols":224,"rows_kept":21,"merged":[[1,2,1,49]]}
[5.56,null," ",{"$nulls":59},"Z-score","難度","PCA loading","鑑別度","PTMEAS"]
[null,null," <worse                                      Mean= 50                        better> ",{"$nulls":47}," "," "]
[null,null,6,8,10,12,14,16,18,20,22,24,26,28,30,32,34,36,38,40,42,44,46,48,"score=50",52,54,56,58,60,62,64,66,68,70,72,74,76,78,80,82,84,86,88,90,92,94,96,98,0,"Z-score"," "," "," "]
[1," ","Teamwork Climate",{"$nulls":34},"★",{"$nulls":16},42.41071428571429,70.31512605042018,85.29220779220779,{"v":75.89285714285714,"d":"75.89"},{"$nulls":4},-1.0349129455087545,0.01,0.6259,{"v":0.4722398142284146,"d":"0.47"},0.6259,{"$nulls":103},"＋",{"$nulls":50},"＋",null,"＋"]
[{"$nulls":24},"∥",{"$nulls":13},"Δ"]
[2,"＋","Safety Climate",{"$nulls":46},"★",2.75,null,null,0.864325502373828,51.25,73.8804347826087,87.76537433155082,{"v":100,"d":"100.00"},{"$nulls":4},2.75278304517642,0.17,0.6715,{"v":0.521531100478469,"d":"0.52"},0.6715,{"$nulls":148},"＋"]
[{"$nulls":24},"∥",{"$nulls":14},"Δ"]
[3," ","Job Satisfaction",{"$nulls":37},"★",{"$nulls":12},0.712317927548217,20.3125,66.8125,82.92509191176471,81.25,{"$nulls":4},0.2192189985080128,0.53,0.6262,{"v":0.5229690406907408,"d":"0.52"},0.6262]
[{"$nulls":24},"∥",{"$nulls":11},"Δ"]
[4,"－","Stress Recognition",{"$nulls":23},"★",{"$nulls":23},-4.55,{"$nulls":3},51.5625,65.15625,84.10661764705883,{"v":53.125,"d":"53.13"},{"$nulls":4},-4.548456434851554,-0.01,0.6721,{"v":0.5062947420390027,"d":"0.51"},0.6721]
[{"$nulls":24},"∥",{"$nulls":12},"Δ"]
[5," ","Perception of Management",{"$nulls":38},"★",{"$nulls":12},39.583333333333336,57.530602636534844,67.70833333333333,{"v":83.33333333333334,"d":"83.33"},{"$nulls":4},1.957860706111584,-0.37,0.6895,{"v":0.452894189736295,"d":"0.45"},0.6895]
[{"$nulls":24},"∥",{"$nulls":6},"Δ"]
[6," ","Working Condition",{"$nulls":33},"★",{"$nulls":17},51.78571428571429,59.82142857142857,68.83673469387755,{"v":73.21428571428571,"d":"73.21"},{"$nulls":4},0.3759272845891502,-0.1,0.7296,{"v":0.5446265938069217,"d":"0.54"},0.7296]
[{"$nulls":24},"∥",{"$nulls":6},"Δ"]
[{"$nulls":24},"∥"]
[null," ",{"$nulls":36},"★",{"$nulls":11}," ",null,null,"Overall Score",78,{"$nulls":3},{"v":51.78571319580078,"d":"51.79"},59.82143020629883,68.83673095703125,73.84453582763672]
[{"$nulls":24},"∥",{"$nulls":10},"Δ",null,null,78,{"$nulls":11},"Outfit= 5.56"]
[{"$nulls":5},"Bottom 20% ",{"$nulls":21},"●"]
[{"$nulls":5},"Middle 60% ",{"$nulls":21},"∥",null,"Δmean"]
[{"$nulls":5},"Top 20% ",{"$nulls":23},"★Case"]

{"sheet":"temp","index":4,"n_rows":503,"n_cols":26,"rows_kept":503}
[null,1,1,1,1,1,1,1,1,1,1,1,1,1,1,1,1,1,1,1,1,1,1,1,1,1]
[75,{"$f":"B1/(1+B1)","v":0.5},{"$f":"C1/(1+C1)","v":0.5},{"$f":"D1/(1+D1)","v":0.5},{"$nulls":9},73.21428571428571,73.21428571428571,73.21428571428571,85.7971420288086,73.21428571428571,73.21428571428571,73.21428571428571]
[79,0.8643255023738279,0.8643255023738279,0.8643255023738279,0.8643255023738279,0.8643255023738279,0.8643255023738279,0.4198555294874605,0.7007350284246068,0.8643255023738277,0.8643255023738277,{"$nulls":5},51.78571319580078]
[68,0.7123179275482168,0.7123179275482168,0.7123179275482168,0.7123179275482168,0.7123179275482168,0.7123179275482168,0,0.5035631136861092,0.7123179275482163,0.7123179275482163,{"$nulls":5},59.82143020629883]
[61,{"$nulls":9},{"$f":"CORREL(B3:K3,B1:K1)","v":{"$error":"#DIV/0!"}},{"$nulls":5},68.83673095703125,{"$nulls":3},-3.492157459259033,-3.858023166656494,-3.182748556137085,18.313886642456055,15.884038925170898,20.965974807739258]
[67,{"$nulls":15},73.84453582763672]
[65,1.418710334858185,1.3920420877760238,1.418710334858185]
[75,{"$f":"B7/(1+B7)","v":0.5865565274236807},{"$f":"C7/(1+C7)","v":0.5819471550645918},{"$f":"D7/(1+D7)","v":0.5865565274236807}]
[67,{"$f":"B7*0.5","v":0.7093551674290925},{"$f":"C7*0.5","v":0.6960210438880119},{"$f":"D7*0.5","v":0.7093551674290925}]
[70,{"$f":"B9/0.5","v":1.418710334858185},{"$f":"C9/0.5","v":1.3920420877760238},{"$f":"D9/0.5","v":1.418710334858185}]
[77,{"$f":"B1*0.5","v":0.5},{"$f":"C1*0.5","v":0.5},{"$f":"D1*0.5","v":0.5}]
[63,1.795686934423606,0.8662948796805979,1.1438560568190819,1.4424566914592538,1.0477214165679964,1.1895809707523646,0.6495970660786919,0.9750108142415153,1.1393092926304924,1.1932629795573682,1.080054918347664]
[71,{"$f":"B12*0.5","v":0.897843467211803},{"$f":"C12*0.5","v":0.43314743984029896},0.5719280284095409,0.7212283457296269,0.5238607082839982,0.5947904853761823,0.32479853303934597,0.48750540712075763,0.5696546463152462,0.5966314897786841,0.540027459173832]
[70]
[73,{"$f":"B1*0.5","v":0.5},{"$f":"C1*0.5","v":0.5},0.5,0.5,0.5,0.5,0.5,0.5,0.5,0.5,0.5]
[72]
[69]
[76]
[79]
[70]
[71]
[78]
[75]
[76]
[75]
[73]
[65]
[71]
[75]
[77]
[74]
[69]
[80]
[80]
[75]
[78]
[73]
[63]
[59]
[63]
[75]
[77]
[67]
[69]
[69]
[79]
[70]
[75]
[74]
[73]
[76]
[66]
[76]
[70]
[63]
[68]
[81]
[74]
[79]
[78]
[86]
[79]
[49]
[69]
[90]
[80]
[91]
[77]
[73]
[70]
[62]
[72]
[75]
[82]
[74]
[82]
[76]
[70]
[63]
[59]
[78]
[{"$f":"AVERAGE(temp!A2:A81)","v":72.6625}]
[67]
[67]
[68]
[69]
[69]
[69]
[70]
[71]
[71]
[72]
[73]
[74]
[75]
[76]
[76]
[78]
[78]
[79]
[79]
[80]
[81]
[82]
[83]
[84]
[85]
[85]
[86]
[86]
[87]
[88]
[89]
[90]
[91]
[92]
[93]
[94]
[94]
[95]
[95]
[95]
[96]
[97]
[98]
[99]
[{"$f":"AVERAGE(temp!A2:A126)","v":76.0933}]
[94]
[{"$f":"AVERAGE(temp!A2:A128)","v":76.23429763779528}]
[64]
[36]
[42]
[26]
[74]
[37]
[44]
[49]
[84]
[68]
[63]
[73]
[54]
[62]
[45]
[25]
[73]
[38]
[23]
[61]
[67]
[51]
[57]
[35]
[70]
[57]
[69]
[13]
[61]
[74]
[19]
[51]
[74]
[71]
[52]
[49]
[78]
[48]
[38]
[67]
[50]
[72]
[57]
[75]
[52]
[30]
[22]
[14]
[56]
[51]
[47]
[54]
[54]
[71]
[50]
[25]
[28]
[53]
[60]
[25]
[35]
[58]
[42]
[45]
[41]
[40]
[25]
[65]
[51]
[72]
[49]
[55]
[54]
[48]
[47]
[31]
[52]
[46]
[65]
[32]
[66]
[50]
[58]
[66]
[76]
[26]
[26]
[51]
[74]
[36]
[15]
[30]
[52]
[61]
[30]
[28]
[56]
[49]
[33]
[53]
[29]
[30]
[64]
[75]
[35]
[46]
[46]
[77]
[64]
[74]
[60]
[71]
[31]
[33]
[67]
[66]
[20]
[76]
[41]
[34]
[21]
[28]
[57]
[67]
[49]
[51]
[57]
[38]
[70]
[41]
[81]
[59]
[67]
[34]
[67]
[72]
[35]
[40]
[28]
[71]
[68]
[55]
[19]
[61]
[55]
[71]
[32]
[69]
[37]
[34]
[24]
[70]
[35]
[76]
[31]
[38]
[33]
[75]
[50]
[58]
[71]
[74]
[53]
[31]
[40]
[64]
[64]
[60]
[22]
[21]
[40]
[37]
[32]
[64]
[29]
[42]
[35]
[75]
[24]
[28]
[43]
[28]
[24]
[16]
[64]
[45]
[54]
[17]
[72]
[17]
[37]
[31]
[51]
[49]
[77]
[38]
[33]
[36]
[60]
[73]
[31]
[68]
[73]
[35]
[48]
[35]
[56]
[52]
[47]
[31]
[45]
[62]
[53]
[63]
[27]
[63]
[69]
[29]
[58]
[18]
[48]
[73]
[67]
[54]
[36]
[58]
[59]
[61]
[33]
[63]
[73]
[58]
[44]
[57]
[73]
[13]
[46]
[46]
[62]
[70]
[75]
[21]
[65]
[56]
[60]
[55]
[45]
[76]
[61]
[46]
[51]
[40]
[15]
[59]
[52]
[58]
[37]
[63]
[72]
[78]
[29]
[64]
[45]
[36]
[61]
[80]
[71]
[52]
[31]
[49]
[27]
[44]
[46]
[66]
[25]
[60]
[70]
[32]
[56]
[57]
[71]
[45]
[53]
[38]
[61]
[77]
[45]
[25]
[32]
[63]
[76]
[33]
[31]
[73]
[51]
[62]
[82]
[42]
[37]
[73]
[41]
[27]
[74]
[23]
[37]
[21]
[29]
[61]
[55]
[19]
[76]
[53]
[72]
[48]
[36]
[49]
[15]
[37]
[73]
[43]
[38]
[39]
[25]
[71]
[82]
[62]
[44]
[34]
[52]
[42]
[48]
[64]
[47]
[53]
[72]
[54]
[23]
[51]
[63]
[46]
[23]
[26]
[35]
[61]
[28]
[83]
[38]
[64]
[72]
[41]
[20]
[27]
[55]
[52]
[70]
[17]
[34]
[51]
[49]
[43]
[45]
[70]
[65]
[20]
[44]
[39]
[29]
[45]
[57]
[27]
[64]
[46]
[55.248]
[" "]

{"sheet":"var2","index":5,"n_rows":81,"n_cols":26,"rows_kept":81}
["var",{"$f":"SUM(B2:B81)","v":13.757924081300471},{"$f":"SUM(C2:C81)","v":12.396761244463537},{"$f":"SUM(D2:D81)","v":14.741703113234651},{"$f":"SUM(E2:E81)","v":14.332268352338494},{"$f":"SUM(F2:F81)","v":18.06926155656367},{"$f":"SUM(G2:G81)","v":17.80927727503917},{"$f":"SUM(H2:H81)","v":0},0,{"$f":"SUM(J2:J76)","v":0},0,0,0,0,0,0,0,0,0,0,0,0,0,0,0,0]
[{"$f":"SUM(B2:G2)","v":1.1041739285486694},{"$f":"trust2!B2*(1-trust2!B2)","v":0.16359610310594755},{"$f":"trust2!C2*(1-trust2!C2)","v":0.14560715830371712},{"$f":"trust2!D2*(1-trust2!D2)","v":0.17694948370508998},{"$f":"trust2!E2*(1-trust2!E2)","v":0.17135289963571745},{"$f":"trust2!F2*(1-trust2!F2)","v":0.22536625271357383},{"$f":"trust2!G2*(1-trust2!G2)","v":0.22130203108462346}]
[{"$f":"SUM(B3:G3)","v":0.9715690434149813},{"$f":"trust2!B3*(1-trust2!B3)","v":0.14026911352122168},{"$f":"trust2!C3*(1-trust2!C3)","v":0.12320141924975105},{"$f":"trust2!D3*(1-trust2!D3)","v":0.15336965473900013},{"$f":"trust2!E3*(1-trust2!E3)","v":0.14782908718043278},{"$f":"trust2!F3*(1-trust2!F3)","v":0.20589660682203234},{"$f":"trust2!G3*(1-trust2!G3)","v":0.20100316190254325}]
[1.2719713923275204,{"$f":"trust2!B4*(1-trust2!B4)","v":0.19600658848252245},{"$f":"trust2!C4*(1-trust2!C4)","v":0.1783466344387175},{"$f":"trust2!D4*(1-trust2!D4)","v":0.20827797641501564},{"$f":"trust2!E4*(1-trust2!E4)","v":0.2032286935290975},{"$f":"trust2!F4*(1-trust2!F4)","v":0.244181446778932},{"$f":"trust2!G4*(1-trust2!G4)","v":0.2419300526832354}]
[1.385340907292834,{"$f":"trust2!B5*(1-trust2!B5)","v":0.22135222592829534},{"$f":"trust2!C5*(1-trust2!C5)","v":0.20606838573343017},{"$f":"trust2!D5*(1-trust2!D5)","v":0.23101067424173052},{"$f":"trust2!E5*(1-trust2!E5)","v":0.22714746337736677},{"$f":"trust2!F5*(1-trust2!F5)","v":0.249997977295827},{"$f":"trust2!G5*(1-trust2!G5)","v":0.24976418071618423}]
[1.303923845097414,{"$f":"trust2!B6*(1-trust2!B6)","v":0.20273405179220993},{"$f":"trust2!C6*(1-trust2!C6)","v":0.18546629778414006},{"$f":"trust2!D6*(1-trust2!D6)","v":0.2145055243701747},{"$f":"trust2!E6*(1-trust2!E6)","v":0.20968853290113576},{"$f":"trust2!F6*(1-trust2!F6)","v":0.24665164112125385},{"$f":"trust2!G6*(1-trust2!G6)","v":0.24487779712849958}]
[1.3230218903321231,{"$f":"trust2!B7*(1-trust2!B7)","v":0.20688118442007244},{"$f":"trust2!C7*(1-trust2!C7)","v":0.18992919014506726},{"$f":"trust2!D7*(1-trust2!D7)","v":0.2182835831668462},{"$f":"trust2!E7*(1-trust2!E7)","v":0.21363583083739868},{"$f":"trust2!F7*(1-trust2!F7)","v":0.24787614707109412},{"$f":"trust2!G7*(1-trust2!G7)","v":0.24641595469164446}]
[1.1013389159390554,{"$f":"trust2!B8*(1-trust2!B8)","v":0.16307988008045818},{"$f":"trust2!C8*(1-trust2!C8)","v":0.14510235192720344},{"$f":"trust2!D8*(1-trust2!D8)","v":0.17643588027790758},{"$f":"trust2!E8*(1-trust2!E8)","v":0.1708369285867971},{"$f":"trust2!F8*(1-trust2!F8)","v":0.22498536871190372},{"$f":"trust2!G8*(1-trust2!G8)","v":0.2208985063547855}]
[1.3024072097576729,{"$f":"trust2!B9*(1-trust2!B9)","v":0.20240907047714274},{"$f":"trust2!C9*(1-trust2!C9)","v":0.1851190850417048},{"$f":"trust2!D9*(1-trust2!D9)","v":0.2142074070611124},{"$f":"trust2!E9*(1-trust2!E9)","v":0.20937803235710722},{"$f":"trust2!F9*(1-trust2!F9)","v":0.24654570034016518},{"$f":"trust2!G9*(1-trust2!G9)","v":0.24474791448044061}]
[1.2371249616092084,{"$f":"trust2!B10*(1-trust2!B10)","v":0.18891809421787495},{"$f":"trust2!C10*(1-trust2!C10)","v":0.17098473475858605},{"$f":"trust2!D10*(1-trust2!D10)","v":0.20159943705543643},{"$f":"trust2!E10*(1-trust2!E10)","v":0.1963555192806987},{"$f":"trust2!F10*(1-trust2!F10)","v":0.24099117080330715},{"$f":"trust2!G10*(1-trust2!G10)","v":0.23827600549330513}]
[1.0548136047234087,{"$f":"trust2!B11*(1-trust2!B11)","v":0.15472485557712745},{"$f":"trust2!C11*(1-trust2!C11)","v":0.13699167994557973},{"$f":"trust2!D11*(1-trust2!D11)","v":0.16806923258598397},{"$f":"trust2!E11*(1-trust2!E11)","v":0.16245562430361268},{"$f":"trust2!F11*(1-trust2!F11)","v":0.21849932535678823},{"$f":"trust2!G11*(1-trust2!G11)","v":0.21407288695431667}]
[1.3675526455063702,{"$f":"trust2!B12*(1-trust2!B12)","v":0.2170367687720649},{"$f":"trust2!C12*(1-trust2!C12)","v":0.2011479644864572},{"$f":"trust2!D12*(1-trust2!D12)","v":0.22730088601843593},{"$f":"trust2!E12*(1-trust2!E12)","v":0.22316740690463202},{"$f":"trust2!F12*(1-trust2!F12)","v":0.24976141444307545},{"$f":"trust2!G12*(1-trust2!G12)","v":0.24913820488170488}]
[1.2151844125594642,{"$f":"trust2!B13*(1-trust2!B13)","v":0.18456706048691834},{"$f":"trust2!C13*(1-trust2!C13)","v":0.1665285501422627},{"$f":"trust2!D13*(1-trust2!D13)","v":0.19744692412645246},{"$f":"trust2!E13*(1-trust2!E13)","v":0.19210641603551565},{"$f":"trust2!F13*(1-trust2!F13)","v":0.23875806551177078},{"$f":"trust2!G13*(1-trust2!G13)","v":0.2357773962565442}]
[1.2339952663068565,{"$f":"trust2!B14*(1-trust2!B14)","v":0.18829248590181671},{"$f":"trust2!C14*(1-trust2!C14)","v":0.17034121664396848},{"$f":"trust2!D14*(1-trust2!D14)","v":0.20100475325309847},{"$f":"trust2!E14*(1-trust2!E14)","v":0.19574592036678026},{"$f":"trust2!F14*(1-trust2!F14)","v":0.2406825574487984},{"$f":"trust2!G14*(1-trust2!G14)","v":0.23792833269239427}]
[1.1548857885398311,{"$f":"trust2!B15*(1-trust2!B15)","v":0.17298188493863467},{"$f":"trust2!C15*(1-trust2!C15)","v":0.154866087821895},{"$f":"trust2!D15*(1-trust2!D15)","v":0.18621542483481388},{"$f":"trust2!E15*(1-trust2!E15)","v":0.18069341362709773},{"$f":"trust2!F15*(1-trust2!F15)","v":0.23187395137328193},{"$f":"trust2!G15*(1-trust2!G15)","v":0.22825502594410793}]
[1.1715769001461058,{"$f":"trust2!B16*(1-trust2!B16)","v":0.176138799380819},{"$f":"trust2!C16*(1-trust2!C16)","v":0.1580168459485199},{"$f":"trust2!D16*(1-trust2!D16)","v":0.18929968963733734},{"$f":"trust2!E16*(1-trust2!E16)","v":0.18381684570894855},{"$f":"trust2!F16*(1-trust2!F16)","v":0.23387974647125256},{"$f":"trust2!G16*(1-trust2!G16)","v":0.23042497299922857}]
[1.251388569317384,{"$f":"trust2!B17*(1-trust2!B17)","v":0.19179149186467429},{"$f":"trust2!C17*(1-trust2!C17)","v":0.17395298708405957},{"$f":"trust2!D17*(1-trust2!D17)","v":0.20432011733081504},{"$f":"trust2!E17*(1-trust2!E17)","v":0.199149306167124},{"$f":"trust2!F17*(1-trust2!F17)","v":0.24235328480962465},{"$f":"trust2!G17*(1-trust2!G17)","v":0.2398213820610866}]
[1.0841403784176302,{"$f":"trust2!B18*(1-trust2!B18)","v":0.1599661895707885},{"$f":"trust2!C18*(1-trust2!C18)","v":0.14206680029841376},{"$f":"trust2!D18*(1-trust2!D18)","v":0.17332960936615874},{"$f":"trust2!E18*(1-trust2!E18)","v":0.16772004469087579},{"$f":"trust2!F18*(1-trust2!F18)","v":0.22263853317535404},{"$f":"trust2!G18*(1-trust2!G18)","v":0.2184192013160395}]
[0.9634960137743264,{"$f":"trust2!B19*(1-trust2!B19)","v":0.138897588259629},{"$f":"trust2!C19*(1-trust2!C19)","v":0.12190768698395045},{"$f":"trust2!D19*(1-trust2!D19)","v":0.15196125135549005},{"$f":"trust2!E19*(1-trust2!E19)","v":0.14643368423732595},{"$f":"trust2!F19*(1-trust2!F19)","v":0.2046127582047036},{"$f":"trust2!G19*(1-trust2!G19)","v":0.1996830447332274}]
[1.2208719528353544,{"$f":"trust2!B20*(1-trust2!B20)","v":0.1856873337001817},{"$f":"trust2!C20*(1-trust2!C20)","v":0.16767163118547238},{"$f":"trust2!D20*(1-trust2!D20)","v":0.19851972956584515},{"$f":"trust2!E20*(1-trust2!E20)","v":0.1932025170884615},{"$f":"trust2!F20*(1-trust2!F20)","v":0.23935220898462475},{"$f":"trust2!G20*(1-trust2!G20)","v":0.236438532310769}]
[1.214581822001691,{"$f":"trust2!B21*(1-trust2!B21)","v":0.1844486701857225},{"$f":"trust2!C21*(1-trust2!C21)","v":0.16640791776626693},{"$f":"trust2!D21*(1-trust2!D21)","v":0.19733340589053222},{"$f":"trust2!E21*(1-trust2!E21)","v":0.19199049827434997},{"$f":"trust2!F21*(1-trust2!F21)","v":0.23869451193460473},{"$f":"trust2!G21*(1-trust2!G21)","v":0.23570681795021475}]
[0.9940639294916164,{"$f":"trust2!B22*(1-trust2!B22)","v":0.14411793547235854},{"$f":"trust2!C22*(1-trust2!C22)","v":0.1268450163482213},{"$f":"trust2!D22*(1-trust2!D22)","v":0.1573096035433501},{"$f":"trust2!E22*(1-trust2!E22)","v":0.15173802407248374},{"$f":"trust2!F22*(1-trust2!F22)","v":0.20941876112730468},{"$f":"trust2!G22*(1-trust2!G22)","v":0.2046345889278981}]
[1.0963917963893985,{"$f":"trust2!B23*(1-trust2!B23)","v":0.16218109674556921},{"$f":"trust2!C23*(1-trust2!C23)","v":0.14422449935915232},{"$f":"trust2!D23*(1-trust2!D23)","v":0.17554070767058114},{"$f":"trust2!E23*(1-trust2!E23)","v":0.1699380494344136},{"$f":"trust2!F23*(1-trust2!F23)","v":0.22431663221338538},{"$f":"trust2!G23*(1-trust2!G23)","v":0.22019081096629692}]
[1.0690692568788114,{"$f":"trust2!B24*(1-trust2!B24)","v":0.1572622253151741},{"$f":"trust2!C24*(1-trust2!C24)","v":0.13944327565247805},{"$f":"trust2!D24*(1-trust2!D24)","v":0.1706206685382805},{"$f":"trust2!E24*(1-trust2!E24)","v":0.16500689078680908},{"$f":"trust2!F24*(1-trust2!F24)","v":0.2205324325363296},{"$f":"trust2!G24*(1-trust2!G24)","v":0.21620376404973995}]
[1.1142094535262064,{"$f":"trust2!B25*(1-trust2!B25)","v":0.16543038236297475},{"$f":"trust2!C25*(1-trust2!C25)","v":0.1474044921385153},{"$f":"trust2!D25*(1-trust2!D25)","v":0.17877119680425163},{"$f":"trust2!E25*(1-trust2!E25)","v":0.17318444991220105},{"$f":"trust2!F25*(1-trust2!F25)","v":0.2267005725368572},{"$f":"trust2!G25*(1-trust2!G25)","v":0.2227183597714065}]
[1.1605764532954561,{"$f":"trust2!B26*(1-trust2!B26)","v":0.1740541948211842},{"$f":"trust2!C26*(1-trust2!C26)","v":0.15593414193618105},{"$f":"trust2!D26*(1-trust2!D26)","v":0.18726496048728242},{"$f":"trust2!E26*(1-trust2!E26)","v":0.18175542620538512},{"$f":"trust2!F26*(1-trust2!F26)","v":0.23256585621342046},{"$f":"trust2!G26*(1-trust2!G26)","v":0.2290018736320028}]
[1.3246219170491305,{"$f":"trust2!B27*(1-trust2!B27)","v":0.20723353651553988},{"$f":"trust2!C27*(1-trust2!C27)","v":0.1903112316394626},{"$f":"trust2!D27*(1-trust2!D27)","v":0.21860224334944614},{"$f":"trust2!E27*(1-trust2!E27)","v":0.21396986607640955},{"$f":"trust2!F27*(1-trust2!F27)","v":0.24796893638663323},{"$f":"trust2!G27*(1-trust2!G27)","v":0.24653610308163912}]
[1.2092512341659205,{"$f":"trust2!B28*(1-trust2!B28)","v":0.1834038502220534},{"$f":"trust2!C28*(1-trust2!C28)","v":0.16534468697054636},{"$f":"trust2!D28*(1-trust2!D28)","v":0.19633040058044293},{"$f":"trust2!E28*(1-trust2!E28)","v":0.1909668276876801},{"$f":"trust2!F28*(1-trust2!F28)","v":0.23812735136436627},{"$f":"trust2!G28*(1-trust2!G28)","v":0.23507811734083137}]
[1.1139320969688018,{"$f":"trust2!B29*(1-trust2!B29)","v":0.16537954062328183},{"$f":"trust2!C29*(1-trust2!C29)","v":0.1473545975317903},{"$f":"trust2!D29*(1-trust2!D29)","v":0.17872077244491558},{"$f":"trust2!E29*(1-trust2!E29)","v":0.1731337227030896},{"$f":"trust2!F29*(1-trust2!F29)","v":0.2266639911640701},{"$f":"trust2!G29*(1-trust2!G29)","v":0.22267947250165446}]
[1.0267776719303419,{"$f":"trust2!B30*(1-trust2!B30)","v":0.1497896439320675},{"$f":"trust2!C30*(1-trust2!C30)","v":0.13225075143132514},{"$f":"trust2!D30*(1-trust2!D30)","v":0.1630814118727841},{"$f":"trust2!E30*(1-trust2!E30)","v":0.15747923270125713},{"$f":"trust2!F30*(1-trust2!F30)","v":0.2143898943874536},{"$f":"trust2!G30*(1-trust2!G30)","v":0.2097867376054543}]
[1.1278993335397183,{"$f":"trust2!B31*(1-trust2!B31)","v":0.16795047301400126},{"$f":"trust2!C31*(1-trust2!C31)","v":0.1498832361227491},{"$f":"trust2!D31*(1-trust2!D31)","v":0.18126558503129656},{"$f":"trust2!E31*(1-trust2!E31)","v":0.17569603899171582},{"$f":"trust2!F31*(1-trust2!F31)","v":0.22848478552598733},{"$f":"trust2!G31*(1-trust2!G31)","v":0.22461921485396838}]
[1.2572969555766713,{"$f":"trust2!B32*(1-trust2!B32)","v":0.19299283648988944},{"$f":"trust2!C32*(1-trust2!C32)","v":0.17520031329880642},{"$f":"trust2!D32*(1-trust2!D32)","v":0.2054522692161857},{"$f":"trust2!E32*(1-trust2!E32)","v":0.20031432295453297},{"$f":"trust2!F32*(1-trust2!F32)","v":0.24289529820813047},{"$f":"trust2!G32*(1-trust2!G32)","v":0.24044191540912607}]
[0.9270697079370891,{"$f":"trust2!B33*(1-trust2!B33)","v":0.13277054866114116},{"$f":"trust2!C33*(1-trust2!C33)","v":0.1161570304998614},{"$f":"trust2!D33*(1-trust2!D33)","v":0.1456419820149883},{"$f":"trust2!E33*(1-trust2!E33)","v":0.14018467716104382},{"$f":"trust2!F33*(1-trust2!F33)","v":0.19869495719223312},{"$f":"trust2!G33*(1-trust2!G33)","v":0.19362051240782113}]
[0.9359385398783409,{"$f":"trust2!B34*(1-trust2!B34)","v":0.13425325683953643},{"$f":"trust2!C34*(1-trust2!C34)","v":0.11754441070851249},{"$f":"trust2!D34*(1-trust2!D34)","v":0.14717526864905722},{"$f":"trust2!E34*(1-trust2!E34)","v":0.14169915888085713},{"$f":"trust2!F34*(1-trust2!F34)","v":0.20015423510998212},{"$f":"trust2!G34*(1-trust2!G34)","v":0.19511220969039553}]
[1.1081748751774398,{"$f":"trust2!B35*(1-trust2!B35)","v":0.16432608740104607},{"$f":"trust2!C35*(1-trust2!C35)","v":0.14632175888893256},{"$f":"trust2!D35*(1-trust2!D35)","v":0.17767507889962394},{"$f":"trust2!E35*(1-trust2!E35)","v":0.17208214228624194},{"$f":"trust2!F35*(1-trust2!F35)","v":0.2259008420722802},{"$f":"trust2!G35*(1-trust2!G35)","v":0.22186896562931507}]
[1.0131989425323351,{"$f":"trust2!B36*(1-trust2!B36)","v":0.14742442350518825},{"$f":"trust2!C36*(1-trust2!C36)","v":0.12999103928526903},{"$f":"trust2!D36*(1-trust2!D36)","v":0.16067949494884115},{"$f":"trust2!E36*(1-trust2!E36)","v":0.15508784985966906},{"$f":"trust2!F36*(1-trust2!F36)","v":0.21234883020526016},{"$f":"trust2!G36*(1-trust2!G36)","v":0.20766730472810754}]
[1.1614963923531618,{"$f":"trust2!B37*(1-trust2!B37)","v":0.1742279265762297},{"$f":"trust2!C37*(1-trust2!C37)","v":0.15610739184206657},{"$f":"trust2!D37*(1-trust2!D37)","v":0.18743481965065859},{"$f":"trust2!E37*(1-trust2!E37)","v":0.18192738631800387},{"$f":"trust2!F37*(1-trust2!F37)","v":0.2326769350448307},{"$f":"trust2!G37*(1-trust2!G37)","v":0.2291219329213724}]
[1.363820325519542,{"$f":"trust2!B38*(1-trust2!B38)","v":0.21615343738498288},{"$f":"trust2!C38*(1-trust2!C38)","v":0.20015335000021214},{"$f":"trust2!D38*(1-trust2!D38)","v":0.22653160776023068},{"$f":"trust2!E38*(1-trust2!E38)","v":0.2223470083541488},{"$f":"trust2!F38*(1-trust2!F38)","v":0.24966758329677677},{"$f":"trust2!G38*(1-trust2!G38)","v":0.24896733872319074}]
[1.4102114779555048,{"$f":"trust2!B39*(1-trust2!B39)","v":0.22777143916718431},{"$f":"trust2!C39*(1-trust2!C39)","v":0.21361151399774744},{"$f":"trust2!D39*(1-trust2!D39)","v":0.23635356030534482},{"$f":"trust2!E39*(1-trust2!E39)","v":0.23296646213311006},{"$f":"trust2!F39*(1-trust2!F39)","v":0.24955864699023647},{"$f":"trust2!G39*(1-trust2!G39)","v":0.24994985536188172}]
[1.3570341995039061,{"$f":"trust2!B40*(1-trust2!B40)","v":0.21456451517047623},{"$f":"trust2!C40*(1-trust2!C40)","v":0.1983740779779619},{"$f":"trust2!D40*(1-trust2!D40)","v":0.2251400296252874},{"$f":"trust2!E40*(1-trust2!E40)","v":0.22086678862039338},{"$f":"trust2!F40*(1-trust2!F40)","v":0.24946272656008875},{"$f":"trust2!G40*(1-trust2!G40)","v":0.24862606154969838}]
[1.1138891954507555,{"$f":"trust2!B41*(1-trust2!B41)","v":0.16537167717469353},{"$f":"trust2!C41*(1-trust2!C41)","v":0.14734688096625165},{"$f":"trust2!D41*(1-trust2!D41)","v":0.17871297319664084},{"$f":"trust2!E41*(1-trust2!E41)","v":0.1731258767690999},{"$f":"trust2!F41*(1-trust2!F41)","v":0.22665833124074333},{"$f":"trust2!G41*(1-trust2!G41)","v":0.22267345610332637}]
[1.0485295183837229,{"$f":"trust2!B42*(1-trust2!B42)","v":0.15361242950688275},{"$f":"trust2!C42*(1-trust2!C42)","v":0.13591992408557255},{"$f":"trust2!D42*(1-trust2!D42)","v":0.1669478276774802},{"$f":"trust2!E42*(1-trust2!E42)","v":0.1613355289584556},{"$f":"trust2!F42*(1-trust2!F42)","v":0.21759081635587402},{"$f":"trust2!G42*(1-trust2!G42)","v":0.21312299179945773}]
[1.2997856206459928,{"$f":"trust2!B43*(1-trust2!B43)","v":0.2018487423921969},{"$f":"trust2!C43*(1-trust2!C43)","v":0.18452124659868574},{"$f":"trust2!D43*(1-trust2!D43)","v":0.213692722485906},{"$f":"trust2!E43*(1-trust2!E43)","v":0.20884228538629548},{"$f":"trust2!F43*(1-trust2!F43)","v":0.24635973859624774},{"$f":"trust2!G43*(1-trust2!G43)","v":0.24452088518666093}]
[1.261780888401403,{"$f":"trust2!B44*(1-trust2!B44)","v":0.1939090889084693},{"$f":"trust2!C44*(1-trust2!C44)","v":0.17615422675727582},{"$f":"trust2!D44*(1-trust2!D44)","v":0.20631356831169023},{"$f":"trust2!E44*(1-trust2!E44)","v":0.20120162545386533},{"$f":"trust2!F44*(1-trust2!F44)","v":0.24329755713115103},{"$f":"trust2!G44*(1-trust2!G44)","v":0.24090482183895137}]
[1.2570090650474262,{"$f":"trust2!B45*(1-trust2!B45)","v":0.1929341438409218},{"$f":"trust2!C45*(1-trust2!C45)","v":0.17513928520779706},{"$f":"trust2!D45*(1-trust2!D45)","v":0.20539703196940806},{"$f":"trust2!E45*(1-trust2!E45)","v":0.20025744783918106},{"$f":"trust2!F45*(1-trust2!F45)","v":0.24286920069718013},{"$f":"trust2!G45*(1-trust2!G45)","v":0.24041195549293812}]
[0.9898996312168667,{"$f":"trust2!B46*(1-trust2!B46)","v":0.143402365286123},{"$f":"trust2!C46*(1-trust2!C46)","v":0.12616612025007543},{"$f":"trust2!D46*(1-trust2!D46)","v":0.156578486568293},{"$f":"trust2!E46*(1-trust2!E46)","v":0.15101205576247753},{"$f":"trust2!F46*(1-trust2!F46)","v":0.20877296250117647},{"$f":"trust2!G46*(1-trust2!G46)","v":0.2039676408487213}]
[1.2402643043953991,{"$f":"trust2!B47*(1-trust2!B47)","v":0.1895473572569285},{"$f":"trust2!C47*(1-trust2!C47)","v":0.1716329872591487},{"$f":"trust2!D47*(1-trust2!D47)","v":0.20219676651071328},{"$f":"trust2!E47*(1-trust2!E47)","v":0.19696820803223253},{"$f":"trust2!F47*(1-trust2!F47)","v":0.24129728043122473},{"$f":"trust2!G47*(1-trust2!G47)","v":0.23862170490515133}]
[1.1090292576418113,{"$f":"trust2!B48*(1-trust2!B48)","v":0.164482194740755},{"$f":"trust2!C48*(1-trust2!C48)","v":0.14647469273423508},{"$f":"trust2!D48*(1-trust2!D48)","v":0.17783014299519276},{"$f":"trust2!E48*(1-trust2!E48)","v":0.17223803213388778},{"$f":"trust2!F48*(1-trust2!F48)","v":0.22601455219852257},{"$f":"trust2!G48*(1-trust2!G48)","v":0.22198964283921802}]
[1.1277267007064542,{"$f":"trust2!B49*(1-trust2!B49)","v":0.16791856258644455},{"$f":"trust2!C49*(1-trust2!C49)","v":0.1498517798409157},{"$f":"trust2!D49*(1-trust2!D49)","v":0.18123406207867165},{"$f":"trust2!E49*(1-trust2!E49)","v":0.1756642711659561},{"$f":"trust2!F49*(1-trust2!F49)","v":0.22846255070957455},{"$f":"trust2!G49*(1-trust2!G49)","v":0.2245954743248916}]
[1.1689081512618797,{"$f":"trust2!B50*(1-trust2!B50)","v":0.17563161918007145},{"$f":"trust2!C50*(1-trust2!C50)","v":0.15750934317407064},{"$f":"trust2!D50*(1-trust2!D50)","v":0.18880533261276516},{"$f":"trust2!E50*(1-trust2!E50)","v":0.18331569581905716},{"$f":"trust2!F50*(1-trust2!F50)","v":0.23356389815766998},{"$f":"trust2!G50*(1-trust2!G50)","v":0.23008226231824536}]
[1.0658411769576615,{"$f":"trust2!B51*(1-trust2!B51)","v":0.15668595696166543},{"$f":"trust2!C51*(1-trust2!C51)","v":0.13888562435449758},{"$f":"trust2!D51*(1-trust2!D51)","v":0.17004199574678663},{"$f":"trust2!E51*(1-trust2!E51)","v":0.16442790955876946},{"$f":"trust2!F51*(1-trust2!F51)","v":0.22007548723932913},{"$f":"trust2!G51*(1-trust2!G51)","v":0.21572420309661314}]
[1.318178684738745,{"$f":"trust2!B52*(1-trust2!B52)","v":0.20581944403318825},{"$f":"trust2!C52*(1-trust2!C52)","v":0.18878077331900428},{"$f":"trust2!D52*(1-trust2!D52)","v":0.2173210989592884},{"$f":"trust2!E52*(1-trust2!E52)","v":0.212627983948405},{"$f":"trust2!F52*(1-trust2!F52)","v":0.24758566750112285},{"$f":"trust2!G52*(1-trust2!G52)","v":0.24604371697773628}]
[1.0761124348365572,{"$f":"trust2!B53*(1-trust2!B53)","v":0.1585230736835118},{"$f":"trust2!C53*(1-trust2!C53)","v":0.14066518642534587},{"$f":"trust2!D53*(1-trust2!D53)","v":0.1718851386479459},{"$f":"trust2!E53*(1-trust2!E53)","v":0.1662727548789817},{"$f":"trust2!F53*(1-trust2!F53)","v":0.22152231327869817},{"$f":"trust2!G53*(1-trust2!G53)","v":0.21724396792207376}]
[1.222764372544545,{"$f":"trust2!B54*(1-trust2!B54)","v":0.18606123952503775},{"$f":"trust2!C54*(1-trust2!C54)","v":0.16805379655658828},{"$f":"trust2!D54*(1-trust2!D54)","v":0.19887723801582155},{"$f":"trust2!E54*(1-trust2!E54)","v":0.19356804019020699},{"$f":"trust2!F54*(1-trust2!F54)","v":0.23954758256224878},{"$f":"trust2!G54*(1-trust2!G54)","v":0.23665647569464157}]
[1.3624560693008878,{"$f":"trust2!B55*(1-trust2!B55)","v":0.2158322689597516},{"$f":"trust2!C55*(1-trust2!C55)","v":0.1997927029820163},{"$f":"trust2!D55*(1-trust2!D55)","v":0.2262511270660352},{"$f":"trust2!E55*(1-trust2!E55)","v":0.22204827184573828},{"$f":"trust2!F55*(1-trust2!F55)","v":0.24962986905959875},{"$f":"trust2!G55*(1-trust2!G55)","v":0.2489018293877477}]
[1.2775179878493608,{"$f":"trust2!B56*(1-trust2!B56)","v":0.19715745215978747},{"$f":"trust2!C56*(1-trust2!C56)","v":0.17955486938086687},{"$f":"trust2!D56*(1-trust2!D56)","v":0.20935138758262492},{"$f":"trust2!E56*(1-trust2!E56)","v":0.20433838571460566},{"$f":"trust2!F56*(1-trust2!F56)","v":0.24464411844115952},{"$f":"trust2!G56*(1-trust2!G56)","v":0.2424717745703163}]
[0.9046563973468554,{"$f":"trust2!B57*(1-trust2!B57)","v":0.1290485699051225},{"$f":"trust2!C57*(1-trust2!C57)","v":0.11268594441587466},{"$f":"trust2!D57*(1-trust2!D57)","v":0.14178187599622638},{"$f":"trust2!E57*(1-trust2!E57)","v":0.13637673831788966},{"$f":"trust2!F57*(1-trust2!F57)","v":0.19495585147506425},{"$f":"trust2!G57*(1-trust2!G57)","v":0.18980741723667802}]
[1.1422606605036694,{"$f":"trust2!B58*(1-trust2!B58)","v":0.17061720458179394},{"$f":"trust2!C58*(1-trust2!C58)","v":0.15251845400107522},{"$f":"trust2!D58*(1-trust2!D58)","v":0.18389420389874792},{"$f":"trust2!E58*(1-trust2!E58)","v":0.17834762093149278},{"$f":"trust2!F58*(1-trust2!F58)","v":0.2303101546099636},{"$f":"trust2!G58*(1-trust2!G58)","v":0.22657302248059583}]
[0.9705707104578124,{"$f":"trust2!B59*(1-trust2!B59)","v":0.14009923208235261},{"$f":"trust2!C59*(1-trust2!C59)","v":0.12304104231669623},{"$f":"trust2!D59*(1-trust2!D59)","v":0.15319532977738576},{"$f":"trust2!E59*(1-trust2!E59)","v":0.14765631744343938},{"$f":"trust2!F59*(1-trust2!F59)","v":0.20573840123544002},{"$f":"trust2!G59*(1-trust2!G59)","v":0.2008403876024983}]
[1.0160749618497065,{"$f":"trust2!B60*(1-trust2!B60)","v":0.14792405850103094},{"$f":"trust2!C60*(1-trust2!C60)","v":0.13046773335515707},{"$f":"trust2!D60*(1-trust2!D60)","v":0.1611874897006216},{"$f":"trust2!E60*(1-trust2!E60)","v":0.15559335136193647},{"$f":"trust2!F60*(1-trust2!F60)","v":0.2127838211283793},{"$f":"trust2!G60*(1-trust2!G60)","v":0.20811850780258118}]
[0.7209800140522435,{"$f":"trust2!B61*(1-trust2!B61)","v":0.09976431225988755},{"$f":"trust2!C61*(1-trust2!C61)","v":0.08590290595009618},{"$f":"trust2!D61*(1-trust2!D61)","v":0.11089207943041038},{"$f":"trust2!E61*(1-trust2!E61)","v":0.10612923426554333},{"$f":"trust2!F61*(1-trust2!F61)","v":0.16182002620265426},{"$f":"trust2!G61*(1-trust2!G61)","v":0.15647145594365186}]
[0.9738173112900277,{"$f":"trust2!B62*(1-trust2!B62)","v":0.14065197621045933},{"$f":"trust2!C62*(1-trust2!C62)","v":0.12356299834033668},{"$f":"trust2!D62*(1-trust2!D62)","v":0.15376240237240407},{"$f":"trust2!E62*(1-trust2!E62)","v":0.14821838710104485},{"$f":"trust2!F62*(1-trust2!F62)","v":0.20625230829042007},{"$f":"trust2!G62*(1-trust2!G62)","v":0.20136923897536266}]
[1.4595087788174121,{"$f":"trust2!B63*(1-trust2!B63)","v":0.24823342095155754},{"$f":"trust2!C63*(1-trust2!C63)","v":0.24219498969557735},{"$f":"trust2!D63*(1-trust2!D63)","v":0.24994549959714862},{"$f":"trust2!E63*(1-trust2!E63)","v":0.24951788982517256},{"$f":"trust2!F63*(1-trust2!F63)","v":0.2331969572344242},{"$f":"trust2!G63*(1-trust2!G63)","v":0.23642002151353197}]
[1.2582902214566818,{"$f":"trust2!B64*(1-trust2!B64)","v":0.1931954594710329},{"$f":"trust2!C64*(1-trust2!C64)","v":0.17541106978083404},{"$f":"trust2!D64*(1-trust2!D64)","v":0.20564290354690481},{"$f":"trust2!E64*(1-trust2!E64)","v":0.20051063730478197},{"$f":"trust2!F64*(1-trust2!F64)","v":0.24298508964312013},{"$f":"trust2!G64*(1-trust2!G64)","v":0.24054506171000808}]
[0.5493062036993944,{"$f":"trust2!B65*(1-trust2!B65)","v":0.07406310717798922},{"$f":"trust2!C65*(1-trust2!C65)","v":0.06306663982660683},{"$f":"trust2!D65*(1-trust2!D65)","v":0.08309852341013885},{"$f":"trust2!E65*(1-trust2!E65)","v":0.07920743304688374},{"$f":"trust2!F65*(1-trust2!F65)","v":0.1273984257836644},{"$f":"trust2!G65*(1-trust2!G65)","v":0.12247207445411137}]
[0.9486678206050928,{"$f":"trust2!B66*(1-trust2!B66)","v":0.13639146571454056},{"$f":"trust2!C66*(1-trust2!C66)","v":0.11954988399596168},{"$f":"trust2!D66*(1-trust2!D66)","v":0.1493818791117343},{"$f":"trust2!E66*(1-trust2!E66)","v":0.14388066544158973},{"$f":"trust2!F66*(1-trust2!F66)","v":0.202228132523528},{"$f":"trust2!G66*(1-trust2!G66)","v":0.19723579381773845}]
[{"$f":"SUM(B67:G67)","v":0.48004355634948226},{"$f":"trust2!B67*(1-trust2!B67)","v":0.06408455581243297},{"$f":"trust2!C67*(1-trust2!C67)","v":0.054347167688689815},{"$f":"trust2!D67*(1-trust2!D67)","v":0.07215183042636338},{"$f":"trust2!E67*(1-trust2!E67)","v":0.06867010487068222},{"$f":"trust2!F67*(1-trust2!F67)","v":0.11269447950970651},{"$f":"trust2!G67*(1-trust2!G67)","v":0.10809541804160738}]
[1.0508908867700668,{"$f":"trust2!B68*(1-trust2!B68)","v":0.15403001532846397},{"$f":"trust2!C68*(1-trust2!C68)","v":0.13632202660512305},{"$f":"trust2!D68*(1-trust2!D68)","v":0.16736898297198377},{"$f":"trust2!E68*(1-trust2!E68)","v":0.16175610520969572},{"$f":"trust2!F68*(1-trust2!F68)","v":0.217933075649622},{"$f":"trust2!G68*(1-trust2!G68)","v":0.2134806810051784}]
[1.1585128514543255,{"$f":"trust2!B69*(1-trust2!B69)","v":0.17366487193639443},{"$f":"trust2!C69*(1-trust2!C69)","v":0.15554610982630168},{"$f":"trust2!D69*(1-trust2!D69)","v":0.18688413023497333},{"$f":"trust2!E69*(1-trust2!E69)","v":0.18136996854941295},{"$f":"trust2!F69*(1-trust2!F69)","v":0.23231589917019294},{"$f":"trust2!G69*(1-trust2!G69)","v":0.22873187173705023}]
[1.2324388925287524,{"$f":"trust2!B70*(1-trust2!B70)","v":0.1879820070259085},{"$f":"trust2!C70*(1-trust2!C70)","v":0.1700222047868023},{"$f":"trust2!D70*(1-trust2!D70)","v":0.20070931940275558},{"$f":"trust2!E70*(1-trust2!E70)","v":0.19544321472738757},{"$f":"trust2!F70*(1-trust2!F70)","v":0.24052782249539803},{"$f":"trust2!G70*(1-trust2!G70)","v":0.23775432409050035}]
[1.3808368533267739,{"$f":"trust2!B71*(1-trust2!B71)","v":0.22024156023016248},{"$f":"trust2!C71*(1-trust2!C71)","v":0.20479174513949128},{"$f":"trust2!D71*(1-trust2!D71)","v":0.23006398747302842},{"$f":"trust2!E71*(1-trust2!E71)","v":0.22612779157462215},{"$f":"trust2!F71*(1-trust2!F71)","v":0.2499739730158244},{"$f":"trust2!G71*(1-trust2!G71)","v":0.24963779589364515}]
[1.1931136714572579,{"$f":"trust2!B72*(1-trust2!B72)","v":0.18026707328753447},{"$f":"trust2!C72*(1-trust2!C72)","v":0.1621671289268371},{"$f":"trust2!D72*(1-trust2!D72)","v":0.19330666538926589},{"$f":"trust2!E72*(1-trust2!E72)","v":0.1878864559619327},{"$f":"trust2!F72*(1-trust2!F72)","v":0.23635772838112817},{"$f":"trust2!G72*(1-trust2!G72)","v":0.2331286195105595}]
[1.0900365605799789,{"$f":"trust2!B73*(1-trust2!B73)","v":0.1610302276645697},{"$f":"trust2!C73*(1-trust2!C73)","v":0.14310236486297825},{"$f":"trust2!D73*(1-trust2!D73)","v":0.1743927150783575},{"$f":"trust2!E73*(1-trust2!E73)","v":0.1687860752731574},{"$f":"trust2!F73*(1-trust2!F73)","v":0.22345001538201711},{"$f":"trust2!G73*(1-trust2!G73)","v":0.21927516231889882}]
[0.8557573115442909,{"$f":"trust2!B74*(1-trust2!B74)","v":0.12104792847529959},{"$f":"trust2!C74*(1-trust2!C74)","v":0.10527867000069949},{"$f":"trust2!D74*(1-trust2!D74)","v":0.13343182622629216},{"$f":"trust2!E74*(1-trust2!E74)","v":0.12816221056883897},{"$f":"trust2!F74*(1-trust2!F74)","v":0.1865539589259785},{"$f":"trust2!G74*(1-trust2!G74)","v":0.18128271734718218}]
[1.118966027079303,{"$f":"trust2!B75*(1-trust2!B75)","v":0.16630361986969253},{"$f":"trust2!C75*(1-trust2!C75)","v":0.1482621545170313},{"$f":"trust2!D75*(1-trust2!D75)","v":0.17963664482009972},{"$f":"trust2!E75*(1-trust2!E75)","v":0.17405537068508506},{"$f":"trust2!F75*(1-trust2!F75)","v":0.22732527638343872},{"$f":"trust2!G75*(1-trust2!G75)","v":0.22338296080395562}]
[0.8583544740906612,{"$f":"trust2!B76*(1-trust2!B76)","v":0.12146888679908374},{"$f":"trust2!C76*(1-trust2!C76)","v":0.10566662615183227},{"$f":"trust2!D76*(1-trust2!D76)","v":0.13387291220158098},{"$f":"trust2!E76*(1-trust2!E76)","v":0.12859538794292036},{"$f":"trust2!F76*(1-trust2!F76)","v":0.18700834385522297},{"$f":"trust2!G76*(1-trust2!G76)","v":0.18174231714002104}]
[1.0856882868971027,{"$f":"trust2!B77*(1-trust2!B77)","v":0.16024518702266857},{"$f":"trust2!C77*(1-trust2!C77)","v":0.14233815598949295},{"$f":"trust2!D77*(1-trust2!D77)","v":0.1736085218100998},{"$f":"trust2!E77*(1-trust2!E77)","v":0.16799965419758356},{"$f":"trust2!F77*(1-trust2!F77)","v":0.22285225823956611},{"$f":"trust2!G77*(1-trust2!G77)","v":0.2186445096376918}]
[1.2234684127340485,{"$f":"trust2!B78*(1-trust2!B78)","v":0.1862004936206351},{"$f":"trust2!C78*(1-trust2!C78)","v":0.1681962103433407},{"$f":"trust2!D78*(1-trust2!D78)","v":0.19901031371217281},{"$f":"trust2!E78*(1-trust2!E78)","v":0.1937041316655954},{"$f":"trust2!F78*(1-trust2!F78)","v":0.23961996881037734},{"$f":"trust2!G78*(1-trust2!G78)","v":0.2367372945819271}]
[1.3586322187792927,{"$f":"trust2!B79*(1-trust2!B79)","v":0.2149367639929532},{"$f":"trust2!C79*(1-trust2!C79)","v":0.1987898175591117},{"$f":"trust2!D79*(1-trust2!D79)","v":0.22546692458974252},{"$f":"trust2!E79*(1-trust2!E79)","v":0.22121407727185657},{"$f":"trust2!F79*(1-trust2!F79)","v":0.2495147917876002},{"$f":"trust2!G79*(1-trust2!G79)","v":0.24870984357802853}]
[1.409122392679932,{"$f":"trust2!B80*(1-trust2!B80)","v":0.2274779256368159},{"$f":"trust2!C80*(1-trust2!C80)","v":0.21325969340076248},{"$f":"trust2!D80*(1-trust2!D80)","v":0.23611463211370406},{"$f":"trust2!E80*(1-trust2!E80)","v":0.2327034996970143},{"$f":"trust2!F80*(1-trust2!F80)","v":0.24960268895521584},{"$f":"trust2!G80*(1-trust2!G80)","v":0.24996395287641926}]
[1.0231130790930725,{"$f":"trust2!B81*(1-trust2!B81)","v":0.14914975066165165},{"$f":"trust2!C81*(1-trust2!C81)","v":0.13163862577552446},{"$f":"trust2!D81*(1-trust2!D81)","v":0.1624323131271238},{"$f":"trust2!E81*(1-trust2!E81)","v":0.15683266541579746},{"$f":"trust2!F81*(1-trust2!F81)","v":0.21384224426661033},{"$f":"trust2!G81*(1-trust2!G81)","v":0.20921747984636477}]

{"sheet":"discriminate","index":6,"n_rows":1,"n_cols":26,"rows_kept":1}
[null,{"$f":"SUM(B2:B81)","v":0},{"$f":"SUM(C2:C81)","v":0},{"$f":"SUM(D2:D81)","v":0},{"$f":"SUM(E2:E81)","v":0},{"$f":"SUM(F2:F81)","v":0},{"$f":"SUM(G2:G81)","v":0},{"$f":"SUM(H2:H81)","v":0},0,{"$f":"SUM(J2:J76)","v":0},0,0,0,0,0,0,0,0,0,0,0,0,0,0,0,0]

{"sheet":"discriminate2","index":7,"n_rows":1,"n_cols":26,"rows_kept":1}
[null,{"$f":"SUM(B2:B81)","v":0},{"$f":"SUM(C2:C81)","v":0},{"$f":"SUM(D2:D81)","v":0},{"$f":"SUM(E2:E81)","v":0},{"$f":"SUM(F2:F81)","v":0},{"$f":"SUM(G2:G81)","v":0},{"$f":"SUM(H2:H81)","v":0},0,{"$f":"SUM(J2:J76)","v":0},0,0,0,0,0,0,0,0,0,0,0,0,0,0,0,0]

{"sheet":"residual","index":8,"n_rows":81,"n_cols":26,"rows_kept":81}
[{"$f":"AVERAGE(A2:A81)","v":1},0.9972689074946258,0.9983019247726332,1.0016974013610407,0.994428303327442,0.9977592713084816,1.0105441917357765,0.9925644352552576,1.0016197273558103,0.9800649282112069,1.0085499276187688,1.1404364554945043,1.0053943540959092,0.9512032454483906,1.0659194789486877,1.0441638967720321,0.9862724910885516,0.9042649897831907,1.001196138205403,1.0476922293475774,0.9208778702030527,0.9745474856687741,1.0841856913756338,1.0078248459032442,0.9666588993455937,1.0115926725430935]
[0.9932705334171879,-0.07210473846997578,0.05286272742026743,-0.058740128614199305,-0.03284474966879802,0.07702294201221038,0.03389195449851723]
[0.9787082538930884,-0.020988669553264505,0.0314121165354696,-6.16671866366858E-3,-0.026673100857435794,0.029575254493571346,-0.00706657980101244]
[1.0003438272965437,-0.027007681325601163,0.044818537135492886,-0.05113469642830759,-0.11001674841709375,0.027887224999412763,0.11552425735987848]
[1.033554773505727,-0.08634837005528584,0.09218701613477209,-0.2003017625368757,-0.012777697604531402,0.06703016290545938,0.1402558363394526]
[1.0156011573128565,-0.0674073324609592,0.06346515550842269,-0.1196497760875137,-0.0820271578115006,0.07546832768444267,0.1302161476285072]
[0.9997226210664553,-0.05969152203187511,-0.0137747903506652,-0.05412125502105891,-0.07239034342610162,0.09310886032001398,0.10693059162739216]
[0.995747600465776,-0.08028136723424173,0.06362093603816166,-0.0725663487483651,-0.018412899358538737,0.040054141278033084,0.06767370713464871]
[1.0059027963705816,-0.10271978060103781,0.033675533510766464,-0.05916698307590518,-0.06148195692919267,0.05878623344872458,0.13097260379679843]
[1.0409077776515747,-0.09303263165863052,0.05912085051913296,-0.1378001924592207,-0.1045747383782275,0.15599094475107766,0.12037167222067924]
[0.9789674928187335,0.03776185080117278,0.003832898613769342,0.020014489599882057,-0.03337898826443786,-0.02609540518585951,-0.002044488302043068]
[0.9975608106559466,0.02379935253148624,0.09147503418495273,-0.025662251349049203,-0.038806572198333944,-0.11961288163747918,0.06885793855911126]
[0.991066919480385,-0.061470899695692305,0.056673974902323954,-0.057369576541185685,-0.046677032344724534,0.03857985396350316,0.07034228197047332]
[1.0263363468717017,-0.12340997181712188,0.09354237359203321,-0.09927838694705238,-0.07862817653636811,0.08055643267242119,0.12729403901419212]
[0.9765676758162248,0.009635215741078396,-0.024207088656528764,0.01018430140774107,0.018228943509965068,-0.005306091546972591,-0.008450782495703746]
[0.9870471699415958,0.04585500723399183,-0.029882991447806484,0.04617886173347452,0.047260408426776035,-0.04540527671623651,-0.06392294034389523]
[0.9858719504807045,0.023487158125353957,-0.036635793961848684,0.04578234393238334,0.05846640719812268,-0.0720469476750818,-0.01897919898447642]
[1.0002514695680933,0.07704449491212662,0.028085761693664058,0.049392577995793774,0.02289781913068356,-0.11516792086995586,-0.06216365373123134]
[1.0009963047232637,0.03785318536595872,0.025135849776031005,0.06300467169277457,0.04983457709629713,-0.0706817057011353,-0.10505420755251216]
[0.9821308784804432,0.0472765898442048,-0.05367448824992771,0.03607905734635741,0.02022730333841749,-0.02299945483696142,-0.026831073284174112]
[0.9905164075314602,0.07275157331223692,-0.03838765937054134,0.045324141511925986,0.04315573528904193,-0.06098413142719705,-0.061780987506624085]
[1.0067650756853843,0.052851509692638854,0.01781555647560229,0.058475160906749535,0.06934483671155767,-0.10390997767303123,-0.09448508161351432]
[0.983269535871313,0.01945415951597862,0.006883927586935679,0.03890654574682628,0.036759333017604146,-0.048080825395444005,-0.05383469696770804]
[0.9805057937731326,0.027034931757735192,-0.017635848438914303,0.023999864506990765,0.030254763639675497,-0.05154107952519993,-0.012022854143060924]
[0.9910419476485347,0.04201163864719071,0.009651561189534585,0.04803732087046786,0.04665847160834646,-0.06176506302477658,-0.08450652324800023]
[0.9822340619941372,0.01503144662469258,-0.03718938306736774,0.039164508435553635,0.042688680733165785,-0.05277012516044011,-0.006841100582520743]
[1.0175276498906327,-0.11410096050696505,-0.03218049641500742,-0.04254338608284536,-0.056543994037103085,0.06583953962327516,0.17959049799369942]
[0.9846675020502437,0.04662520175024287,-0.031580860964259716,0.04762987385491446,-0.010545555558747699,-0.07163529536586977,0.01958591329282733]
[0.9852717472389348,0.02206987879739819,-0.025165820596977806,0.04388786630324404,0.04585014386596775,-0.07468157040721324,-0.011873074713342757]
[1.0042193654360148,0.03611837799305351,-0.03533360382266448,0.07432103927473666,0.08840585917232324,-0.09235223389395653,-0.07106816152193018]
[0.9853204878505788,0.03944997106257975,-0.0669805138743943,0.03754341822143692,0.044173834559400604,-0.036832169888302624,-0.017268026196231467]
[0.9784412036724052,-2.3331581474026475E-3,-0.03749531385600302,0.013311666415470658,0.022097157834479297,-0.02595605978270199,0.030448828671044148]
[0.9933197454712572,0.011508237085875339,0.03188171856522115,0.05337553818704521,0.04503650375882373,-0.05605161960011029,-0.08565793711852698]
[0.9837331769735047,-0.005191379675488328,0.01844187708451661,0.03658136218137398,0.04200281861606947,-0.04333740876112746,-0.04840481060738744]
[0.9884122700238143,0.03160281054943559,-0.006313091400011794,0.05310096781799101,0.043690685974941856,-0.08426445853552633,-0.037729141633739305]
[0.9892250740138459,0.03476779602894653,0.03004749328530254,0.03017875489794597,0.03475272645685856,-0.08987242680354057,-0.03978272103005853]
[0.9781218262328631,0.01714343794548112,-0.02204400750105795,0.038932173271429504,-1.1416644382142849E-3,-0.006617114978141436,-0.02618887501285183]
[1.0517808334505132,-0.09111721028757425,0.09673636659816731,-0.1688189693322466,-0.12566688689124672,0.1317677016472626,0.15715066680155365]
[1.0860516923831447,-0.20266388590182366,-0.05325766302367141,-0.17931797676152061,0.05698740341679687,0.13906395886860012,0.23922414502842448]
[1.0134576832320146,-0.0799842249017424,0.02434911566263731,-0.11470169864118518,-0.06326266261136837,0.11223750706345292,0.1214154671186628]
[0.9768717010624663,0.019862414090634717,-0.01757267374189786,0.010725469343913607,0.00802042652093693,0.003806216690549258,-0.024754426996624557]
[0.977944071837779,2.9005783926454587E-3,-0.027071937830506654,0.025068310406245464,0.008685813924322994,0.018227179856899034,-0.027719356405326412]
[0.9797787763031228,0.010345463598513738,-0.059196989338841766,-0.002814906985138088,-0.00893981845915326,0.030964440768240453,0.029707948552521235]
[0.9775075388129307,0.011694213596167735,-0.028951670255392692,3.1193588754730994E-3,-0.0181461883299735,0.034553120072168375,-2.196374582048688E-3]
[0.9786091909420863,0.0468296772543052,0.00889313825818816,-0.0205691477186144,0.009782116059114165,-0.01569406019857089,-0.029168560585120407]
[0.9863279592893682,0.05297135361027072,-0.06940038327618314,0.020913169178375268,0.02600150399640766,-0.04262775580985323,0.012234183992223424]
[0.9857404483590355,-0.013728334221791205,-0.02801801105946866,-0.043158736552807664,-0.04038247990084487,0.0493398373175542,0.07602321612943419]
[0.983685149689295,-0.025852642457167452,-0.06818205977914849,0.030462662167873522,-0.00653690081127456,0.047508592673103256,0.02268807002552331]
[0.9841940689214872,0.031358560987083006,-0.08083703588911628,0.04089239729520977,0.014072956278468496,-0.01654809511334654,0.011147742107421088]
[0.9768530780151896,0.010404452036593015,-0.029122766043466974,6.7131560248223643E-4,0.011298207612038258,0.01849802761341357,-0.011665929625147009]
[1.0028312095668894,0.06059795502857812,-0.09583823009895276,0.07660653596411537,0.06684792357590119,-0.047987030614063286,-0.06013723802462556]
[0.9828181486172791,-0.038316712412292175,-0.06617519411126205,0.03797693496897381,0.03129094325694304,0.036801642432667925,-1.5150620584991614E-3]
[0.9927960956104748,0.07254847278202048,0.006841847863002015,1.7596399657868744E-3,0.054393394544001605,-0.04375333099320389,-0.09170056165234197]
[0.9925653928506771,0.019460279964209293,-0.11438747299185359,-0.03079093204864991,0.028070880250851027,0.02797126844123443,0.0697536835304452]
[0.982145280759749,0.047297702918440376,-0.04906984852492691,-0.013481693345762213,-0.02656270335841604,0.05715010149463651,-0.01528151451234483]
[0.991673867794942,-0.004428641499713559,-0.10291501581322249,0.07572873960301818,0.016782965996022914,-0.036725555322848935,0.051627510202481686]
[1.0098056690807258,0.0718621358616488,0.016940887867906596,0.07728476778879256,0.02229450266722588,-0.06794822741496598,-0.12034176726216428]
[0.976155608240565,0.006643331112721529,-0.010970348470314861,0.01554577549292735,-0.016117120196434076,0.007596157153493932,-0.00261231021667252]
[1.012253923398085,0.01751312673699268,0.031186994787863798,0.04397914740007858,0.05650846265305831,0.02067619892794803,-0.169771618801978]
[1.097877842483747,-0.06056468593215769,0.15426561257976823,0.014485721316279232,-0.27600664946110365,0.14041838090190395,0.027493175497810718]
[1.00663096835833,0.0186475132431263,0.009683732050808413,0.02901689404313612,0.03333904555280898,0.04395796059074086,-0.1345581342235458]
[0.9944035706967111,0.026464729971523493,0.019420189465623183,0.03352814772715329,0.009092693016905962,0.03389606686431801,-0.12230954752066725]
[1.098593780788966,-0.02417354888642076,-0.07584596937281674,-0.3042574388146041,0.00929299258033034,0.23379321782643414,0.16117602189207358]
[0.9839785964469051,0.01676500943226522,-0.027574025963816085,-0.018646959125810936,-0.06732811919226989,0.04422112879703055,0.052635941997944746]
[1.10270551605693,0.05376596610624307,0.06764209250507147,0.091464228506412,0.08672942646116666,-0.12097840928947978,-0.17853909430053694]
[0.9817579122596609,-0.014915793963236723,0.005321213241920364,0.032796404673172574,-3.8846269619828844E-3,0.037265569295559575,-0.05649032064410142]
[1.0667543433613997,0.03279870014669728,0.03310442177297568,0.03787002974564868,0.04669307084325813,0.04037194478458506,-0.1907416546240287]
[0.986932275106619,0.04288834454667634,-0.02700539282859482,0.016254824279188118,0.06524594787043736,-0.05797864974484623,-0.03931457089152346]
[0.990060217697088,0.04123419634244763,0.014541483810017408,-2.5215752425733484E-4,0.02415947139333885,0.03498716920849687,-0.1145859635444898]
[0.980387349639598,0.024504840938739503,-0.03337163868035975,0.007388363210580451,0.049096514919021894,-0.04240086998053183,-5.1407016125748495E-3]
[0.9843723721504843,0.00427936724353295,-0.07512232916725547,-0.008382445118341852,-0.021693837816213368,0.028926112934260506,0.07203976794092004]
[0.9830635054046963,0.027384153938367017,-0.07761610985934764,0.0174767355602905,0.006354467560600208,0.0409379598834142,-0.014456204848518617]
[0.9766577843321651,-0.010534505326725174,-0.02013385615837171,0.01622539293802505,-0.010832841761097667,0.009091168115813675,0.016273423142430854]
[0.996726096059722,0.031844905783207644,0.04189886089266892,0.06482918374283642,0.010322297057935637,-0.07480164254657407,-0.07400205998299714]
[0.9759635316911034,0.011143161859302642,0.00478629441115308,-0.009010919058764277,-7.611781451180244E-3,-0.009956285744813886,0.010736635624091107]
[1.0304279334302189,0.05845192441984415,0.046337676103857084,0.07172575244244317,0.056255853823766966,-0.060703608274608634,-0.1719759990593125]
[0.99325497973601,0.04699983282639242,0.05938135680746959,0.03184855298527023,-0.02925475233482777,-0.10794753597661277,-9.3845208373866118E-4]
[0.981366241487621,0.0271762630888972,-0.019346951289995196,0.01898270695109816,0.033565829586181706,-0.06716021586021981,0.006859989605951355]
[1.0807680983762566,-0.2631446555509013,0.2549533309107527,0.015244621687689586,-0.0681016468553195,-1.1941089239922986E-3,0.062295538214247714]
[1.004402763438963,-0.016144991743574533,-0.022927611105829304,-0.04752369090201425,-0.11589115985492315,0.05812710720645692,0.1443967828236703]
[0.9879177016040441,0.0451539315483116,0.03877562083662378,0.03415974626546414,1.4073788026001122E-3,-0.03911026136297402,-0.08029503935022286]

{"sheet":"trust2","index":9,"n_rows":81,"n_cols":9,"rows_kept":81}
[{"$f":"STDEV(var!B2:'var'!G81)","v":0.9999999999999991},-0.22892132807283674,-0.4175327637975321,-0.0899327721153805,-0.14828542287372726,0.47021417915014746,0.41445810770932906,0.36123190147085565,0.3179039981236279]
[1.119952169469898,{"$f":" EXP(1*(trust2!$A2-trust2!B$1))/(1+EXP(1*(trust2!$A2-trust2!B$1)))","v":0.793945397810635},{"$f":" EXP(1*(trust2!$A2-trust2!C$1))/(1+EXP(1*(trust2!$A2-trust2!C$1)))","v":0.8230988110412709},{"$f":" EXP(1*(trust2!$A2-trust2!D$1))/(1+EXP(1*(trust2!$A2-trust2!D$1)))","v":0.7702785901526609},{"$f":" EXP(1*(trust2!$A2-trust2!E$1))/(1+EXP(1*(trust2!$A2-trust2!E$1)))","v":0.7804409035149519},{"$f":" EXP(1*(trust2!$A2-trust2!F$1))/(1+EXP(1*(trust2!$A2-trust2!F$1)))","v":0.6569514169621484},{"$f":" EXP(1*(trust2!$A2-trust2!G$1))/(1+EXP(1*(trust2!$A2-trust2!G$1)))","v":0.6694047487981861}]
[1.3656374632439923,{"$f":" EXP(1*(trust2!$A3-trust2!B$1))/(1+EXP(1*(trust2!$A3-trust2!B$1)))","v":0.8312565266961216},{"$f":" EXP(1*(trust2!$A3-trust2!C$1))/(1+EXP(1*(trust2!$A3-trust2!C$1)))","v":0.8560878834645304},{"$f":" EXP(1*(trust2!$A3-trust2!D$1))/(1+EXP(1*(trust2!$A3-trust2!D$1)))","v":0.8108542186636686},{"$f":" EXP(1*(trust2!$A3-trust2!E$1))/(1+EXP(1*(trust2!$A3-trust2!E$1)))","v":0.8196418508574358},{"$f":" EXP(1*(trust2!$A3-trust2!F$1))/(1+EXP(1*(trust2!$A3-trust2!F$1)))","v":0.7100080788397619},{"$f":" EXP(1*(trust2!$A3-trust2!G$1))/(1+EXP(1*(trust2!$A3-trust2!G$1)))","v":0.7213522940867267}]
[0.7777326865661225,{"$f":" EXP(1*(trust2!$A4-trust2!B$1))/(1+EXP(1*(trust2!$A4-trust2!B$1)))","v":0.7323648241827441},{"$f":" EXP(1*(trust2!$A4-trust2!C$1))/(1+EXP(1*(trust2!$A4-trust2!C$1)))","v":0.7676814628645071},{"$f":" EXP(1*(trust2!$A4-trust2!D$1))/(1+EXP(1*(trust2!$A4-trust2!D$1)))","v":0.7042596964283075},{"$f":" EXP(1*(trust2!$A4-trust2!E$1))/(1+EXP(1*(trust2!$A4-trust2!E$1)))","v":0.7162667484170937},{"$f":" EXP(1*(trust2!$A4-trust2!F$1))/(1+EXP(1*(trust2!$A4-trust2!F$1)))","v":0.576279441667254},{"$f":" EXP(1*(trust2!$A4-trust2!G$1))/(1+EXP(1*(trust2!$A4-trust2!G$1)))","v":0.5898328854972644}]
[0.47590306668044857,{"$f":" EXP(1*(trust2!$A5-trust2!B$1))/(1+EXP(1*(trust2!$A5-trust2!B$1)))","v":0.669256533320592},{"$f":" EXP(1*(trust2!$A5-trust2!C$1))/(1+EXP(1*(trust2!$A5-trust2!C$1)))","v":0.7095986981509423},{"$f":" EXP(1*(trust2!$A5-trust2!D$1))/(1+EXP(1*(trust2!$A5-trust2!D$1)))","v":0.6378017625368757},{"$f":" EXP(1*(trust2!$A5-trust2!E$1))/(1+EXP(1*(trust2!$A5-trust2!E$1)))","v":0.6511705547473886},{"$f":" EXP(1*(trust2!$A5-trust2!F$1))/(1+EXP(1*(trust2!$A5-trust2!F$1)))","v":0.5014222180469216},{"$f":" EXP(1*(trust2!$A5-trust2!G$1))/(1+EXP(1*(trust2!$A5-trust2!G$1)))","v":0.5153564085585066}]
[0.7027159343710342,{"$f":" EXP(1*(trust2!$A6-trust2!B$1))/(1+EXP(1*(trust2!$A6-trust2!B$1)))","v":0.7174073324609592},{"$f":" EXP(1*(trust2!$A6-trust2!C$1))/(1+EXP(1*(trust2!$A6-trust2!C$1)))","v":0.7540348444915774},{"$f":" EXP(1*(trust2!$A6-trust2!D$1))/(1+EXP(1*(trust2!$A6-trust2!D$1)))","v":0.6883997760875137},{"$f":" EXP(1*(trust2!$A6-trust2!E$1))/(1+EXP(1*(trust2!$A6-trust2!E$1)))","v":0.7007771578115006},{"$f":" EXP(1*(trust2!$A6-trust2!F$1))/(1+EXP(1*(trust2!$A6-trust2!F$1)))","v":0.5578650056488906},{"$f":" EXP(1*(trust2!$A6-trust2!G$1))/(1+EXP(1*(trust2!$A6-trust2!G$1)))","v":0.5715695666572072}]
[0.6550799896454451,{"$f":" EXP(1*(trust2!$A7-trust2!B$1))/(1+EXP(1*(trust2!$A7-trust2!B$1)))","v":0.7076507057053444},{"$f":" EXP(1*(trust2!$A7-trust2!C$1))/(1+EXP(1*(trust2!$A7-trust2!C$1)))","v":0.7450934716693465},{"$f":" EXP(1*(trust2!$A7-trust2!D$1))/(1+EXP(1*(trust2!$A7-trust2!D$1)))","v":0.6780910352408391},{"$f":" EXP(1*(trust2!$A7-trust2!E$1))/(1+EXP(1*(trust2!$A7-trust2!E$1)))","v":0.6906939148546731},{"$f":" EXP(1*(trust2!$A7-trust2!F$1))/(1+EXP(1*(trust2!$A7-trust2!F$1)))","v":0.5460852788741252},{"$f":" EXP(1*(trust2!$A7-trust2!G$1))/(1+EXP(1*(trust2!$A7-trust2!G$1)))","v":0.5598668965986674}]
[1.1253200926556348,{"$f":" EXP(1*(trust2!$A8-trust2!B$1))/(1+EXP(1*(trust2!$A8-trust2!B$1)))","v":0.7948221835607725},{"$f":" EXP(1*(trust2!$A8-trust2!C$1))/(1+EXP(1*(trust2!$A8-trust2!C$1)))","v":0.8238790639618383},{"$f":" EXP(1*(trust2!$A8-trust2!D$1))/(1+EXP(1*(trust2!$A8-trust2!D$1)))","v":0.7712270630340793},{"$f":" EXP(1*(trust2!$A8-trust2!E$1))/(1+EXP(1*(trust2!$A8-trust2!E$1)))","v":0.7813593279299673},{"$f":" EXP(1*(trust2!$A8-trust2!F$1))/(1+EXP(1*(trust2!$A8-trust2!F$1)))","v":0.6581601444362526},{"$f":" EXP(1*(trust2!$A8-trust2!G$1))/(1+EXP(1*(trust2!$A8-trust2!G$1)))","v":0.6705915989878004}]
[0.7063991830144746,{"$f":" EXP(1*(trust2!$A9-trust2!B$1))/(1+EXP(1*(trust2!$A9-trust2!B$1)))","v":0.7181534540704255},{"$f":" EXP(1*(trust2!$A9-trust2!C$1))/(1+EXP(1*(trust2!$A9-trust2!C$1)))","v":0.7547173236320907},{"$f":" EXP(1*(trust2!$A9-trust2!D$1))/(1+EXP(1*(trust2!$A9-trust2!D$1)))","v":0.6891893045044767},{"$f":" EXP(1*(trust2!$A9-trust2!E$1))/(1+EXP(1*(trust2!$A9-trust2!E$1)))","v":0.701548921214907},{"$f":" EXP(1*(trust2!$A9-trust2!F$1))/(1+EXP(1*(trust2!$A9-trust2!F$1)))","v":0.5587732903607991},{"$f":" EXP(1*(trust2!$A9-trust2!G$1))/(1+EXP(1*(trust2!$A9-trust2!G$1)))","v":0.572471273754222}]
[0.8545351830425777,{"$f":" EXP(1*(trust2!$A10-trust2!B$1))/(1+EXP(1*(trust2!$A10-trust2!B$1)))","v":0.7471475384909286},{"$f":" EXP(1*(trust2!$A10-trust2!C$1))/(1+EXP(1*(trust2!$A10-trust2!C$1)))","v":0.7810965407852148},{"$f":" EXP(1*(trust2!$A10-trust2!D$1))/(1+EXP(1*(trust2!$A10-trust2!D$1)))","v":0.7200012794157424},{"$f":" EXP(1*(trust2!$A10-trust2!E$1))/(1+EXP(1*(trust2!$A10-trust2!E$1)))","v":0.7316127818564885},{"$f":" EXP(1*(trust2!$A10-trust2!F$1))/(1+EXP(1*(trust2!$A10-trust2!F$1)))","v":0.5949148523503717},{"$f":" EXP(1*(trust2!$A10-trust2!G$1))/(1+EXP(1*(trust2!$A10-trust2!G$1)))","v":0.6082773961023022}]
[1.2124487138643893,{"$f":" EXP(1*(trust2!$A11-trust2!B$1))/(1+EXP(1*(trust2!$A11-trust2!B$1)))","v":0.8086667206273986},{"$f":" EXP(1*(trust2!$A11-trust2!C$1))/(1+EXP(1*(trust2!$A11-trust2!C$1)))","v":0.8361671013862306},{"$f":" EXP(1*(trust2!$A11-trust2!D$1))/(1+EXP(1*(trust2!$A11-trust2!D$1)))","v":0.786235510400118},{"$f":" EXP(1*(trust2!$A11-trust2!E$1))/(1+EXP(1*(trust2!$A11-trust2!E$1)))","v":0.7958789882644378},{"$f":" EXP(1*(trust2!$A11-trust2!F$1))/(1+EXP(1*(trust2!$A11-trust2!F$1)))","v":0.6774842940747484},{"$f":" EXP(1*(trust2!$A11-trust2!G$1))/(1+EXP(1*(trust2!$A11-trust2!G$1)))","v":0.6895444883020431}]
[0.5320187049290297,{"$f":" EXP(1*(trust2!$A12-trust2!B$1))/(1+EXP(1*(trust2!$A12-trust2!B$1)))","v":0.6815577903256567},{"$f":" EXP(1*(trust2!$A12-trust2!C$1))/(1+EXP(1*(trust2!$A12-trust2!C$1)))","v":0.7210249658150473},{"$f":" EXP(1*(trust2!$A12-trust2!D$1))/(1+EXP(1*(trust2!$A12-trust2!D$1)))","v":0.6506622513490492},{"$f":" EXP(1*(trust2!$A12-trust2!E$1))/(1+EXP(1*(trust2!$A12-trust2!E$1)))","v":0.6638065721983339},{"$f":" EXP(1*(trust2!$A12-trust2!F$1))/(1+EXP(1*(trust2!$A12-trust2!F$1)))","v":0.5154462149708126},{"$f":" EXP(1*(trust2!$A12-trust2!G$1))/(1+EXP(1*(trust2!$A12-trust2!G$1)))","v":0.5293563471551744}]
[0.9008604826457333,{"$f":" EXP(1*(trust2!$A13-trust2!B$1))/(1+EXP(1*(trust2!$A13-trust2!B$1)))","v":0.7557986307881293},{"$f":" EXP(1*(trust2!$A13-trust2!C$1))/(1+EXP(1*(trust2!$A13-trust2!C$1)))","v":0.7889142603917939},{"$f":" EXP(1*(trust2!$A13-trust2!D$1))/(1+EXP(1*(trust2!$A13-trust2!D$1)))","v":0.7292445765411857},{"$f":" EXP(1*(trust2!$A13-trust2!E$1))/(1+EXP(1*(trust2!$A13-trust2!E$1)))","v":0.7406108558741362},{"$f":" EXP(1*(trust2!$A13-trust2!F$1))/(1+EXP(1*(trust2!$A13-trust2!F$1)))","v":0.6060279891737518},{"$f":" EXP(1*(trust2!$A13-trust2!G$1))/(1+EXP(1*(trust2!$A13-trust2!G$1)))","v":0.6192585583656611}]
[0.861228699991923,{"$f":" EXP(1*(trust2!$A14-trust2!B$1))/(1+EXP(1*(trust2!$A14-trust2!B$1)))","v":0.7484099718171219},{"$f":" EXP(1*(trust2!$A14-trust2!C$1))/(1+EXP(1*(trust2!$A14-trust2!C$1)))","v":0.7822388764079667},{"$f":" EXP(1*(trust2!$A14-trust2!D$1))/(1+EXP(1*(trust2!$A14-trust2!D$1)))","v":0.7213486994470524},{"$f":" EXP(1*(trust2!$A14-trust2!E$1))/(1+EXP(1*(trust2!$A14-trust2!E$1)))","v":0.7329250515363681},{"$f":" EXP(1*(trust2!$A14-trust2!F$1))/(1+EXP(1*(trust2!$A14-trust2!F$1)))","v":0.5965269006609121},{"$f":" EXP(1*(trust2!$A14-trust2!G$1))/(1+EXP(1*(trust2!$A14-trust2!G$1)))","v":0.6098711395572365}]
[1.0223587933974891,{"$f":" EXP(1*(trust2!$A15-trust2!B$1))/(1+EXP(1*(trust2!$A15-trust2!B$1)))","v":0.7775213776655149},{"$f":" EXP(1*(trust2!$A15-trust2!C$1))/(1+EXP(1*(trust2!$A15-trust2!C$1)))","v":0.8084378578872979},{"$f":" EXP(1*(trust2!$A15-trust2!D$1))/(1+EXP(1*(trust2!$A15-trust2!D$1)))","v":0.7525560832076434},{"$f":" EXP(1*(trust2!$A15-trust2!E$1))/(1+EXP(1*(trust2!$A15-trust2!E$1)))","v":0.7632614411054195},{"$f":" EXP(1*(trust2!$A15-trust2!F$1))/(1+EXP(1*(trust2!$A15-trust2!F$1)))","v":0.6346330146238955},{"$f":" EXP(1*(trust2!$A15-trust2!G$1))/(1+EXP(1*(trust2!$A15-trust2!G$1)))","v":0.6474617715066928}]
[0.9894350439518281,{"$f":" EXP(1*(trust2!$A16-trust2!B$1))/(1+EXP(1*(trust2!$A16-trust2!B$1)))","v":0.771774172097315},{"$f":" EXP(1*(trust2!$A16-trust2!C$1))/(1+EXP(1*(trust2!$A16-trust2!C$1)))","v":0.8032872467669554},{"$f":" EXP(1*(trust2!$A16-trust2!D$1))/(1+EXP(1*(trust2!$A16-trust2!D$1)))","v":0.7463743297558872},{"$f":" EXP(1*(trust2!$A16-trust2!E$1))/(1+EXP(1*(trust2!$A16-trust2!E$1)))","v":0.7572608681689686},{"$f":" EXP(1*(trust2!$A16-trust2!F$1))/(1+EXP(1*(trust2!$A16-trust2!F$1)))","v":0.6269655604041798},{"$f":" EXP(1*(trust2!$A16-trust2!G$1))/(1+EXP(1*(trust2!$A16-trust2!G$1)))","v":0.639910782289184}]
[0.823629330045279,{"$f":" EXP(1*(trust2!$A17-trust2!B$1))/(1+EXP(1*(trust2!$A17-trust2!B$1)))","v":0.7412643946696771},{"$f":" EXP(1*(trust2!$A17-trust2!C$1))/(1+EXP(1*(trust2!$A17-trust2!C$1)))","v":0.7757662287444574},{"$f":" EXP(1*(trust2!$A17-trust2!D$1))/(1+EXP(1*(trust2!$A17-trust2!D$1)))","v":0.713728525632834},{"$f":" EXP(1*(trust2!$A17-trust2!E$1))/(1+EXP(1*(trust2!$A17-trust2!E$1)))","v":0.7255009841062251},{"$f":" EXP(1*(trust2!$A17-trust2!F$1))/(1+EXP(1*(trust2!$A17-trust2!F$1)))","v":0.5874454983997195},{"$f":" EXP(1*(trust2!$A17-trust2!G$1))/(1+EXP(1*(trust2!$A17-trust2!G$1)))","v":0.6008891368726752}]
[1.157725229159442,{"$f":" EXP(1*(trust2!$A18-trust2!B$1))/(1+EXP(1*(trust2!$A18-trust2!B$1)))","v":0.8000563454240078},{"$f":" EXP(1*(trust2!$A18-trust2!C$1))/(1+EXP(1*(trust2!$A18-trust2!C$1)))","v":0.8285318853651594},{"$f":" EXP(1*(trust2!$A18-trust2!D$1))/(1+EXP(1*(trust2!$A18-trust2!D$1)))","v":0.7768941867100884},{"$f":" EXP(1*(trust2!$A18-trust2!E$1))/(1+EXP(1*(trust2!$A18-trust2!E$1)))","v":0.7868448279281399},{"$f":" EXP(1*(trust2!$A18-trust2!F$1))/(1+EXP(1*(trust2!$A18-trust2!F$1)))","v":0.6654130189091716},{"$f":" EXP(1*(trust2!$A18-trust2!G$1))/(1+EXP(1*(trust2!$A18-trust2!G$1)))","v":0.6777098722186263}]
[1.3804226322605528,{"$f":" EXP(1*(trust2!$A19-trust2!B$1))/(1+EXP(1*(trust2!$A19-trust2!B$1)))","v":0.8333202840217964},{"$f":" EXP(1*(trust2!$A19-trust2!C$1))/(1+EXP(1*(trust2!$A19-trust2!C$1)))","v":0.8578998645096831},{"$f":" EXP(1*(trust2!$A19-trust2!D$1))/(1+EXP(1*(trust2!$A19-trust2!D$1)))","v":0.8131113997357968},{"$f":" EXP(1*(trust2!$A19-trust2!E$1))/(1+EXP(1*(trust2!$A19-trust2!E$1)))","v":0.8218172086179887},{"$f":" EXP(1*(trust2!$A19-trust2!F$1))/(1+EXP(1*(trust2!$A19-trust2!F$1)))","v":0.7130428168122465},{"$f":" EXP(1*(trust2!$A19-trust2!G$1))/(1+EXP(1*(trust2!$A19-trust2!G$1)))","v":0.7243144116341449}]
[0.8889810450458856,{"$f":" EXP(1*(trust2!$A20-trust2!B$1))/(1+EXP(1*(trust2!$A20-trust2!B$1)))","v":0.7535994209374665},{"$f":" EXP(1*(trust2!$A20-trust2!C$1))/(1+EXP(1*(trust2!$A20-trust2!C$1)))","v":0.7869292052310598},{"$f":" EXP(1*(trust2!$A20-trust2!D$1))/(1+EXP(1*(trust2!$A20-trust2!D$1)))","v":0.72689264076685},{"$f":" EXP(1*(trust2!$A20-trust2!E$1))/(1+EXP(1*(trust2!$A20-trust2!E$1)))","v":0.7383222249634693},{"$f":" EXP(1*(trust2!$A20-trust2!F$1))/(1+EXP(1*(trust2!$A20-trust2!F$1)))","v":0.6031881340822444},{"$f":" EXP(1*(trust2!$A20-trust2!G$1))/(1+EXP(1*(trust2!$A20-trust2!G$1)))","v":0.616453714793608}]
[0.9021141338167086,{"$f":" EXP(1*(trust2!$A21-trust2!B$1))/(1+EXP(1*(trust2!$A21-trust2!B$1)))","v":0.7560299392928052},{"$f":" EXP(1*(trust2!$A21-trust2!C$1))/(1+EXP(1*(trust2!$A21-trust2!C$1)))","v":0.7891229534881883},{"$f":" EXP(1*(trust2!$A21-trust2!D$1))/(1+EXP(1*(trust2!$A21-trust2!D$1)))","v":0.7294920349586621},{"$f":" EXP(1*(trust2!$A21-trust2!E$1))/(1+EXP(1*(trust2!$A21-trust2!E$1)))","v":0.7408516176521346},{"$f":" EXP(1*(trust2!$A21-trust2!F$1))/(1+EXP(1*(trust2!$A21-trust2!F$1)))","v":0.606327268682099},{"$f":" EXP(1*(trust2!$A21-trust2!G$1))/(1+EXP(1*(trust2!$A21-trust2!G$1)))","v":0.6195540967503216}]
[1.3244161416415203,{"$f":" EXP(1*(trust2!$A22-trust2!B$1))/(1+EXP(1*(trust2!$A22-trust2!B$1)))","v":0.8253952435541144},{"$f":" EXP(1*(trust2!$A22-trust2!C$1))/(1+EXP(1*(trust2!$A22-trust2!C$1)))","v":0.8509344435243977},{"$f":" EXP(1*(trust2!$A22-trust2!D$1))/(1+EXP(1*(trust2!$A22-trust2!D$1)))","v":0.8044509754568868},{"$f":" EXP(1*(trust2!$A22-trust2!E$1))/(1+EXP(1*(trust2!$A22-trust2!E$1)))","v":0.8134676632884423},{"$f":" EXP(1*(trust2!$A22-trust2!F$1))/(1+EXP(1*(trust2!$A22-trust2!F$1)))","v":0.7014478564609098},{"$f":" EXP(1*(trust2!$A22-trust2!G$1))/(1+EXP(1*(trust2!$A22-trust2!G$1)))","v":0.7129915751200078}]
[1.1346686502534322,{"$f":" EXP(1*(trust2!$A23-trust2!B$1))/(1+EXP(1*(trust2!$A23-trust2!B$1)))","v":0.7963425437807248},{"$f":" EXP(1*(trust2!$A23-trust2!C$1))/(1+EXP(1*(trust2!$A23-trust2!C$1)))","v":0.8252314570284487},{"$f":" EXP(1*(trust2!$A23-trust2!D$1))/(1+EXP(1*(trust2!$A23-trust2!D$1)))","v":0.7728723004070198},{"$f":" EXP(1*(trust2!$A23-trust2!E$1))/(1+EXP(1*(trust2!$A23-trust2!E$1)))","v":0.7829522054439343},{"$f":" EXP(1*(trust2!$A23-trust2!F$1))/(1+EXP(1*(trust2!$A23-trust2!F$1)))","v":0.6602603125749311},{"$f":" EXP(1*(trust2!$A23-trust2!G$1))/(1+EXP(1*(trust2!$A23-trust2!G$1)))","v":0.6726533782863894}]
[1.1859222221520271,{"$f":" EXP(1*(trust2!$A24-trust2!B$1))/(1+EXP(1*(trust2!$A24-trust2!B$1)))","v":0.8045287748059712},{"$f":" EXP(1*(trust2!$A24-trust2!C$1))/(1+EXP(1*(trust2!$A24-trust2!C$1)))","v":0.8325007133037792},{"$f":" EXP(1*(trust2!$A24-trust2!D$1))/(1+EXP(1*(trust2!$A24-trust2!D$1)))","v":0.7817433787362527},{"$f":" EXP(1*(trust2!$A24-trust2!E$1))/(1+EXP(1*(trust2!$A24-trust2!E$1)))","v":0.791535776900865},{"$f":" EXP(1*(trust2!$A24-trust2!F$1))/(1+EXP(1*(trust2!$A24-trust2!F$1)))","v":0.67166119964532},{"$f":" EXP(1*(trust2!$A24-trust2!G$1))/(1+EXP(1*(trust2!$A24-trust2!G$1)))","v":0.6838375259577327}]
[1.100884764385988,{"$f":" EXP(1*(trust2!$A25-trust2!B$1))/(1+EXP(1*(trust2!$A25-trust2!B$1)))","v":0.7908085583971443},{"$f":" EXP(1*(trust2!$A25-trust2!C$1))/(1+EXP(1*(trust2!$A25-trust2!C$1)))","v":0.8203053353621895},{"$f":" EXP(1*(trust2!$A25-trust2!D$1))/(1+EXP(1*(trust2!$A25-trust2!D$1)))","v":0.7668872480950493},{"$f":" EXP(1*(trust2!$A25-trust2!E$1))/(1+EXP(1*(trust2!$A25-trust2!E$1)))","v":0.7771561835640672},{"$f":" EXP(1*(trust2!$A25-trust2!F$1))/(1+EXP(1*(trust2!$A25-trust2!F$1)))","v":0.6526414998063856},{"$f":" EXP(1*(trust2!$A25-trust2!G$1))/(1+EXP(1*(trust2!$A25-trust2!G$1)))","v":0.665171547878542}]
[1.0111858227705928,{"$f":" EXP(1*(trust2!$A26-trust2!B$1))/(1+EXP(1*(trust2!$A26-trust2!B$1)))","v":0.7755826648735653},{"$f":" EXP(1*(trust2!$A26-trust2!C$1))/(1+EXP(1*(trust2!$A26-trust2!C$1)))","v":0.806701578189319},{"$f":" EXP(1*(trust2!$A26-trust2!D$1))/(1+EXP(1*(trust2!$A26-trust2!D$1)))","v":0.7504696379059098},{"$f":" EXP(1*(trust2!$A26-trust2!E$1))/(1+EXP(1*(trust2!$A26-trust2!E$1)))","v":0.761236624144883},{"$f":" EXP(1*(trust2!$A26-trust2!F$1))/(1+EXP(1*(trust2!$A26-trust2!F$1)))","v":0.6320384178433669},{"$f":" EXP(1*(trust2!$A26-trust2!G$1))/(1+EXP(1*(trust2!$A26-trust2!G$1)))","v":0.644907302673113}]
[0.6509740497499945,{"$f":" EXP(1*(trust2!$A27-trust2!B$1))/(1+EXP(1*(trust2!$A27-trust2!B$1)))","v":0.7068005403388978},{"$f":" EXP(1*(trust2!$A27-trust2!C$1))/(1+EXP(1*(trust2!$A27-trust2!C$1)))","v":0.7443128493561839},{"$f":" EXP(1*(trust2!$A27-trust2!D$1))/(1+EXP(1*(trust2!$A27-trust2!D$1)))","v":0.6771941213769629},{"$f":" EXP(1*(trust2!$A27-trust2!E$1))/(1+EXP(1*(trust2!$A27-trust2!E$1)))","v":0.6898160528606325},{"$f":" EXP(1*(trust2!$A27-trust2!F$1))/(1+EXP(1*(trust2!$A27-trust2!F$1)))","v":0.5450673231218228},{"$f":" EXP(1*(trust2!$A27-trust2!G$1))/(1+EXP(1*(trust2!$A27-trust2!G$1)))","v":0.558854880157561}]
[0.9131639796253272,{"$f":" EXP(1*(trust2!$A28-trust2!B$1))/(1+EXP(1*(trust2!$A28-trust2!B$1)))","v":0.7580622982497571},{"$f":" EXP(1*(trust2!$A28-trust2!C$1))/(1+EXP(1*(trust2!$A28-trust2!C$1)))","v":0.7909558609642597},{"$f":" EXP(1*(trust2!$A28-trust2!D$1))/(1+EXP(1*(trust2!$A28-trust2!D$1)))","v":0.7316670011450855},{"$f":" EXP(1*(trust2!$A28-trust2!E$1))/(1+EXP(1*(trust2!$A28-trust2!E$1)))","v":0.7429674305587477},{"$f":" EXP(1*(trust2!$A28-trust2!F$1))/(1+EXP(1*(trust2!$A28-trust2!F$1)))","v":0.6089616842547587},{"$f":" EXP(1*(trust2!$A28-trust2!G$1))/(1+EXP(1*(trust2!$A28-trust2!G$1)))","v":0.6221551581357441}]
[1.1014131724458234,{"$f":" EXP(1*(trust2!$A29-trust2!B$1))/(1+EXP(1*(trust2!$A29-trust2!B$1)))","v":0.7908959597119186},{"$f":" EXP(1*(trust2!$A29-trust2!C$1))/(1+EXP(1*(trust2!$A29-trust2!C$1)))","v":0.8203832119013256},{"$f":" EXP(1*(trust2!$A29-trust2!D$1))/(1+EXP(1*(trust2!$A29-trust2!D$1)))","v":0.7669816989141474},{"$f":" EXP(1*(trust2!$A29-trust2!E$1))/(1+EXP(1*(trust2!$A29-trust2!E$1)))","v":0.7772476822209888},{"$f":" EXP(1*(trust2!$A29-trust2!F$1))/(1+EXP(1*(trust2!$A29-trust2!F$1)))","v":0.6527612805521409},{"$f":" EXP(1*(trust2!$A29-trust2!G$1))/(1+EXP(1*(trust2!$A29-trust2!G$1)))","v":0.6652892237816657}]
[1.2642927188533477,{"$f":" EXP(1*(trust2!$A30-trust2!B$1))/(1+EXP(1*(trust2!$A30-trust2!B$1)))","v":0.8165601934355179},{"$f":" EXP(1*(trust2!$A30-trust2!C$1))/(1+EXP(1*(trust2!$A30-trust2!C$1)))","v":0.8431461038226645},{"$f":" EXP(1*(trust2!$A30-trust2!D$1))/(1+EXP(1*(trust2!$A30-trust2!D$1)))","v":0.7948195857252633},{"$f":" EXP(1*(trust2!$A30-trust2!E$1))/(1+EXP(1*(trust2!$A30-trust2!E$1)))","v":0.8041722658276768},{"$f":" EXP(1*(trust2!$A30-trust2!F$1))/(1+EXP(1*(trust2!$A30-trust2!F$1)))","v":0.6887064005606233},{"$f":" EXP(1*(trust2!$A30-trust2!G$1))/(1+EXP(1*(trust2!$A30-trust2!G$1)))","v":0.7005324472362159}]
[1.0746944645650909,{"$f":" EXP(1*(trust2!$A31-trust2!B$1))/(1+EXP(1*(trust2!$A31-trust2!B$1)))","v":0.7864428860802773},{"$f":" EXP(1*(trust2!$A31-trust2!C$1))/(1+EXP(1*(trust2!$A31-trust2!C$1)))","v":0.8164123320562126},{"$f":" EXP(1*(trust2!$A31-trust2!D$1))/(1+EXP(1*(trust2!$A31-trust2!D$1)))","v":0.7621724908694721},{"$f":" EXP(1*(trust2!$A31-trust2!E$1))/(1+EXP(1*(trust2!$A31-trust2!E$1)))","v":0.772587529076963},{"$f":" EXP(1*(trust2!$A31-trust2!F$1))/(1+EXP(1*(trust2!$A31-trust2!F$1)))","v":0.6466806547367875},{"$f":" EXP(1*(trust2!$A31-trust2!G$1))/(1+EXP(1*(trust2!$A31-trust2!G$1)))","v":0.6593134807416862}]
[0.8106212137474202,{"$f":" EXP(1*(trust2!$A32-trust2!B$1))/(1+EXP(1*(trust2!$A32-trust2!B$1)))","v":0.7387617295759741},{"$f":" EXP(1*(trust2!$A32-trust2!C$1))/(1+EXP(1*(trust2!$A32-trust2!C$1)))","v":0.773495313856003},{"$f":" EXP(1*(trust2!$A32-trust2!D$1))/(1+EXP(1*(trust2!$A32-trust2!D$1)))","v":0.7110633335845293},{"$f":" EXP(1*(trust2!$A32-trust2!E$1))/(1+EXP(1*(trust2!$A32-trust2!E$1)))","v":0.7229028421655207},{"$f":" EXP(1*(trust2!$A32-trust2!F$1))/(1+EXP(1*(trust2!$A32-trust2!F$1)))","v":0.5842893931160352},{"$f":" EXP(1*(trust2!$A32-trust2!G$1))/(1+EXP(1*(trust2!$A32-trust2!G$1)))","v":0.5977654570432416}]
[1.447182067816287,{"$f":" EXP(1*(trust2!$A33-trust2!B$1))/(1+EXP(1*(trust2!$A33-trust2!B$1)))","v":0.8423878668102286},{"$f":" EXP(1*(trust2!$A33-trust2!C$1))/(1+EXP(1*(trust2!$A33-trust2!C$1)))","v":0.8658455541620516},{"$f":" EXP(1*(trust2!$A33-trust2!D$1))/(1+EXP(1*(trust2!$A33-trust2!D$1)))","v":0.8230449163584094},{"$f":" EXP(1*(trust2!$A33-trust2!E$1))/(1+EXP(1*(trust2!$A33-trust2!E$1)))","v":0.8313839507866309},{"$f":" EXP(1*(trust2!$A33-trust2!F$1))/(1+EXP(1*(trust2!$A33-trust2!F$1)))","v":0.7265061650546556},{"$f":" EXP(1*(trust2!$A33-trust2!G$1))/(1+EXP(1*(trust2!$A33-trust2!G$1)))","v":0.7374436514042413}]
[1.4309127616970672,{"$f":" EXP(1*(trust2!$A34-trust2!B$1))/(1+EXP(1*(trust2!$A34-trust2!B$1)))","v":0.840215730324839},{"$f":" EXP(1*(trust2!$A34-trust2!C$1))/(1+EXP(1*(trust2!$A34-trust2!C$1)))","v":0.863944486551847},{"$f":" EXP(1*(trust2!$A34-trust2!D$1))/(1+EXP(1*(trust2!$A34-trust2!D$1)))","v":0.8206629560004441},{"$f":" EXP(1*(trust2!$A34-trust2!E$1))/(1+EXP(1*(trust2!$A34-trust2!E$1)))","v":0.8290909313839305},{"$f":" EXP(1*(trust2!$A34-trust2!F$1))/(1+EXP(1*(trust2!$A34-trust2!F$1)))","v":0.7232616511853701},{"$f":" EXP(1*(trust2!$A34-trust2!G$1))/(1+EXP(1*(trust2!$A34-trust2!G$1)))","v":0.7342814339840109}]
[1.112362964463159,{"$f":" EXP(1*(trust2!$A35-trust2!B$1))/(1+EXP(1*(trust2!$A35-trust2!B$1)))","v":0.792701063542574},{"$f":" EXP(1*(trust2!$A35-trust2!C$1))/(1+EXP(1*(trust2!$A35-trust2!C$1)))","v":0.8219910575017068},{"$f":" EXP(1*(trust2!$A35-trust2!D$1))/(1+EXP(1*(trust2!$A35-trust2!D$1)))","v":0.7689329304870939},{"$f":" EXP(1*(trust2!$A35-trust2!E$1))/(1+EXP(1*(trust2!$A35-trust2!E$1)))","v":0.7791377038555667},{"$f":" EXP(1*(trust2!$A35-trust2!F$1))/(1+EXP(1*(trust2!$A35-trust2!F$1)))","v":0.6552390348067129},{"$f":" EXP(1*(trust2!$A35-trust2!G$1))/(1+EXP(1*(trust2!$A35-trust2!G$1)))","v":0.6677230883649742}]
[1.2892851313669085,{"$f":" EXP(1*(trust2!$A36-trust2!B$1))/(1+EXP(1*(trust2!$A36-trust2!B$1)))","v":0.8202742207777762},{"$f":" EXP(1*(trust2!$A36-trust2!C$1))/(1+EXP(1*(trust2!$A36-trust2!C$1)))","v":0.8464230949499917},{"$f":" EXP(1*(trust2!$A36-trust2!D$1))/(1+EXP(1*(trust2!$A36-trust2!D$1)))","v":0.7988653627491129},{"$f":" EXP(1*(trust2!$A36-trust2!E$1))/(1+EXP(1*(trust2!$A36-trust2!E$1)))","v":0.8080781558960826},{"$f":" EXP(1*(trust2!$A36-trust2!F$1))/(1+EXP(1*(trust2!$A36-trust2!F$1)))","v":0.6940390934702073},{"$f":" EXP(1*(trust2!$A36-trust2!G$1))/(1+EXP(1*(trust2!$A36-trust2!G$1)))","v":0.7057491075846806}]
[1.009374713270051,{"$f":" EXP(1*(trust2!$A37-trust2!B$1))/(1+EXP(1*(trust2!$A37-trust2!B$1)))","v":0.7752672763402332},{"$f":" EXP(1*(trust2!$A37-trust2!C$1))/(1+EXP(1*(trust2!$A37-trust2!C$1)))","v":0.806419007501058},{"$f":" EXP(1*(trust2!$A37-trust2!D$1))/(1+EXP(1*(trust2!$A37-trust2!D$1)))","v":0.7501303267285705},{"$f":" EXP(1*(trust2!$A37-trust2!E$1))/(1+EXP(1*(trust2!$A37-trust2!E$1)))","v":0.7609072894382143},{"$f":" EXP(1*(trust2!$A37-trust2!F$1))/(1+EXP(1*(trust2!$A37-trust2!F$1)))","v":0.6316171149781414},{"$f":" EXP(1*(trust2!$A37-trust2!G$1))/(1+EXP(1*(trust2!$A37-trust2!G$1)))","v":0.6444924464414233}]
[0.5431757222163025,{"$f":" EXP(1*(trust2!$A38-trust2!B$1))/(1+EXP(1*(trust2!$A38-trust2!B$1)))","v":0.6839743531447172},{"$f":" EXP(1*(trust2!$A38-trust2!C$1))/(1+EXP(1*(trust2!$A38-trust2!C$1)))","v":0.7232636334018325},{"$f":" EXP(1*(trust2!$A38-trust2!D$1))/(1+EXP(1*(trust2!$A38-trust2!D$1)))","v":0.6531939693322466},{"$f":" EXP(1*(trust2!$A38-trust2!E$1))/(1+EXP(1*(trust2!$A38-trust2!E$1)))","v":0.6662918868912467},{"$f":" EXP(1*(trust2!$A38-trust2!F$1))/(1+EXP(1*(trust2!$A38-trust2!F$1)))","v":0.5182322983527374},{"$f":" EXP(1*(trust2!$A38-trust2!G$1))/(1+EXP(1*(trust2!$A38-trust2!G$1)))","v":0.5321350474841606}]
[0.3861310621331479,{"$f":" EXP(1*(trust2!$A39-trust2!B$1))/(1+EXP(1*(trust2!$A39-trust2!B$1)))","v":0.6490924573303951},{"$f":" EXP(1*(trust2!$A39-trust2!C$1))/(1+EXP(1*(trust2!$A39-trust2!C$1)))","v":0.6907576630236714},{"$f":" EXP(1*(trust2!$A39-trust2!D$1))/(1+EXP(1*(trust2!$A39-trust2!D$1)))","v":0.6168179767615206},{"$f":" EXP(1*(trust2!$A39-trust2!E$1))/(1+EXP(1*(trust2!$A39-trust2!E$1)))","v":0.6305125965832031},{"$f":" EXP(1*(trust2!$A39-trust2!F$1))/(1+EXP(1*(trust2!$A39-trust2!F$1)))","v":0.47899159668695546},{"$f":" EXP(1*(trust2!$A39-trust2!G$1))/(1+EXP(1*(trust2!$A39-trust2!G$1)))","v":0.4929187121144326}]
[0.5629973222553226,{"$f":" EXP(1*(trust2!$A40-trust2!B$1))/(1+EXP(1*(trust2!$A40-trust2!B$1)))","v":0.6882431534731709},{"$f":" EXP(1*(trust2!$A40-trust2!C$1))/(1+EXP(1*(trust2!$A40-trust2!C$1)))","v":0.7272133843373627},{"$f":" EXP(1*(trust2!$A40-trust2!D$1))/(1+EXP(1*(trust2!$A40-trust2!D$1)))","v":0.6576704486411852},{"$f":" EXP(1*(trust2!$A40-trust2!E$1))/(1+EXP(1*(trust2!$A40-trust2!E$1)))","v":0.6706845376113684},{"$f":" EXP(1*(trust2!$A40-trust2!F$1))/(1+EXP(1*(trust2!$A40-trust2!F$1)))","v":0.5231791596032138},{"$f":" EXP(1*(trust2!$A40-trust2!G$1))/(1+EXP(1*(trust2!$A40-trust2!G$1)))","v":0.5370666757384801}]
[1.1014948991191724,{"$f":" EXP(1*(trust2!$A41-trust2!B$1))/(1+EXP(1*(trust2!$A41-trust2!B$1)))","v":0.790909475310287},{"$f":" EXP(1*(trust2!$A41-trust2!C$1))/(1+EXP(1*(trust2!$A41-trust2!C$1)))","v":0.8203952543870592},{"$f":" EXP(1*(trust2!$A41-trust2!D$1))/(1+EXP(1*(trust2!$A41-trust2!D$1)))","v":0.7669963048496349},{"$f":" EXP(1*(trust2!$A41-trust2!E$1))/(1+EXP(1*(trust2!$A41-trust2!E$1)))","v":0.7772618315435792},{"$f":" EXP(1*(trust2!$A41-trust2!F$1))/(1+EXP(1*(trust2!$A41-trust2!F$1)))","v":0.6527798048148271},{"$f":" EXP(1*(trust2!$A41-trust2!G$1))/(1+EXP(1*(trust2!$A41-trust2!G$1)))","v":0.6653074223883296}]
[1.224103209713228,{"$f":" EXP(1*(trust2!$A42-trust2!B$1))/(1+EXP(1*(trust2!$A42-trust2!B$1)))","v":0.8104634769068936},{"$f":" EXP(1*(trust2!$A42-trust2!C$1))/(1+EXP(1*(trust2!$A42-trust2!C$1)))","v":0.8377574217014742},{"$f":" EXP(1*(trust2!$A42-trust2!D$1))/(1+EXP(1*(trust2!$A42-trust2!D$1)))","v":0.7881877379808513},{"$f":" EXP(1*(trust2!$A42-trust2!E$1))/(1+EXP(1*(trust2!$A42-trust2!E$1)))","v":0.7977657989789029},{"$f":" EXP(1*(trust2!$A42-trust2!F$1))/(1+EXP(1*(trust2!$A42-trust2!F$1)))","v":0.680025508315144},{"$f":" EXP(1*(trust2!$A42-trust2!G$1))/(1+EXP(1*(trust2!$A42-trust2!G$1)))","v":0.6920338725343586}]
[0.7127342154803961,{"$f":" EXP(1*(trust2!$A43-trust2!B$1))/(1+EXP(1*(trust2!$A43-trust2!B$1)))","v":0.7194339481661921},{"$f":" EXP(1*(trust2!$A43-trust2!C$1))/(1+EXP(1*(trust2!$A43-trust2!C$1)))","v":0.7558881658094299},{"$f":" EXP(1*(trust2!$A43-trust2!D$1))/(1+EXP(1*(trust2!$A43-trust2!D$1)))","v":0.6905446863969027},{"$f":" EXP(1*(trust2!$A43-trust2!E$1))/(1+EXP(1*(trust2!$A43-trust2!E$1)))","v":0.7028736419885652},{"$f":" EXP(1*(trust2!$A43-trust2!F$1))/(1+EXP(1*(trust2!$A43-trust2!F$1)))","v":0.5603345788396028},{"$f":" EXP(1*(trust2!$A43-trust2!G$1))/(1+EXP(1*(trust2!$A43-trust2!G$1)))","v":0.5740210430441174}]
[0.8006624685351489,{"$f":" EXP(1*(trust2!$A44-trust2!B$1))/(1+EXP(1*(trust2!$A44-trust2!B$1)))","v":0.736835198168538},{"$f":" EXP(1*(trust2!$A44-trust2!C$1))/(1+EXP(1*(trust2!$A44-trust2!C$1)))","v":0.7717457879024515},{"$f":" EXP(1*(trust2!$A44-trust2!D$1))/(1+EXP(1*(trust2!$A44-trust2!D$1)))","v":0.7090129940657034},{"$f":" EXP(1*(trust2!$A44-trust2!E$1))/(1+EXP(1*(trust2!$A44-trust2!E$1)))","v":0.72090354127115},{"$f":" EXP(1*(trust2!$A44-trust2!F$1))/(1+EXP(1*(trust2!$A44-trust2!F$1)))","v":0.5818684485552826},{"$f":" EXP(1*(trust2!$A44-trust2!G$1))/(1+EXP(1*(trust2!$A44-trust2!G$1)))","v":0.5953686434896116}]
[0.8112580123627746,{"$f":" EXP(1*(trust2!$A45-trust2!B$1))/(1+EXP(1*(trust2!$A45-trust2!B$1)))","v":0.7388846084599805},{"$f":" EXP(1*(trust2!$A45-trust2!C$1))/(1+EXP(1*(trust2!$A45-trust2!C$1)))","v":0.7736068617418118},{"$f":" EXP(1*(trust2!$A45-trust2!D$1))/(1+EXP(1*(trust2!$A45-trust2!D$1)))","v":0.7111941477186144},{"$f":" EXP(1*(trust2!$A45-trust2!E$1))/(1+EXP(1*(trust2!$A45-trust2!E$1)))","v":0.7230303839408858},{"$f":" EXP(1*(trust2!$A45-trust2!F$1))/(1+EXP(1*(trust2!$A45-trust2!F$1)))","v":0.5844440601985709},{"$f":" EXP(1*(trust2!$A45-trust2!G$1))/(1+EXP(1*(trust2!$A45-trust2!G$1)))","v":0.5979185605851204}]
[1.3320517018435598,{"$f":" EXP(1*(trust2!$A46-trust2!B$1))/(1+EXP(1*(trust2!$A46-trust2!B$1)))","v":0.8264929321040151},{"$f":" EXP(1*(trust2!$A46-trust2!C$1))/(1+EXP(1*(trust2!$A46-trust2!C$1)))","v":0.8519003832761831},{"$f":" EXP(1*(trust2!$A46-trust2!D$1))/(1+EXP(1*(trust2!$A46-trust2!D$1)))","v":0.8056493308216247},{"$f":" EXP(1*(trust2!$A46-trust2!E$1))/(1+EXP(1*(trust2!$A46-trust2!E$1)))","v":0.8146234960035923},{"$f":" EXP(1*(trust2!$A46-trust2!F$1))/(1+EXP(1*(trust2!$A46-trust2!F$1)))","v":0.70304442247652},{"$f":" EXP(1*(trust2!$A46-trust2!G$1))/(1+EXP(1*(trust2!$A46-trust2!G$1)))","v":0.7145515302934908}]
[0.8477903324034902,{"$f":" EXP(1*(trust2!$A47-trust2!B$1))/(1+EXP(1*(trust2!$A47-trust2!B$1)))","v":0.7458711913646483},{"$f":" EXP(1*(trust2!$A47-trust2!C$1))/(1+EXP(1*(trust2!$A47-trust2!C$1)))","v":0.7799410879825456},{"$f":" EXP(1*(trust2!$A47-trust2!D$1))/(1+EXP(1*(trust2!$A47-trust2!D$1)))","v":0.7186395057835768},{"$f":" EXP(1*(trust2!$A47-trust2!E$1))/(1+EXP(1*(trust2!$A47-trust2!E$1)))","v":0.730286326054691},{"$f":" EXP(1*(trust2!$A47-trust2!F$1))/(1+EXP(1*(trust2!$A47-trust2!F$1)))","v":0.5932883678106509},{"$f":" EXP(1*(trust2!$A47-trust2!G$1))/(1+EXP(1*(trust2!$A47-trust2!G$1)))","v":0.6066690915628734}]
[1.1107402046506494,{"$f":" EXP(1*(trust2!$A48-trust2!B$1))/(1+EXP(1*(trust2!$A48-trust2!B$1)))","v":0.7924342751102288},{"$f":" EXP(1*(trust2!$A48-trust2!C$1))/(1+EXP(1*(trust2!$A48-trust2!C$1)))","v":0.821753488350577},{"$f":" EXP(1*(trust2!$A48-trust2!D$1))/(1+EXP(1*(trust2!$A48-trust2!D$1)))","v":0.7686444806892694},{"$f":" EXP(1*(trust2!$A48-trust2!E$1))/(1+EXP(1*(trust2!$A48-trust2!E$1)))","v":0.7788583293827033},{"$f":" EXP(1*(trust2!$A48-trust2!F$1))/(1+EXP(1*(trust2!$A48-trust2!F$1)))","v":0.6548723597078492},{"$f":" EXP(1*(trust2!$A48-trust2!G$1))/(1+EXP(1*(trust2!$A48-trust2!G$1)))","v":0.6673629503826399}]
[1.075026116392888,{"$f":" EXP(1*(trust2!$A49-trust2!B$1))/(1+EXP(1*(trust2!$A49-trust2!B$1)))","v":0.7864985818700599},{"$f":" EXP(1*(trust2!$A49-trust2!C$1))/(1+EXP(1*(trust2!$A49-trust2!C$1)))","v":0.8164620358891163},{"$f":" EXP(1*(trust2!$A49-trust2!D$1))/(1+EXP(1*(trust2!$A49-trust2!D$1)))","v":0.7622326027047902},{"$f":" EXP(1*(trust2!$A49-trust2!E$1))/(1+EXP(1*(trust2!$A49-trust2!E$1)))","v":0.7726457937215315},{"$f":" EXP(1*(trust2!$A49-trust2!F$1))/(1+EXP(1*(trust2!$A49-trust2!F$1)))","v":0.6467564284466798},{"$f":" EXP(1*(trust2!$A49-trust2!G$1))/(1+EXP(1*(trust2!$A49-trust2!G$1)))","v":0.6593879721782933}]
[0.9947310821866281,{"$f":" EXP(1*(trust2!$A50-trust2!B$1))/(1+EXP(1*(trust2!$A50-trust2!B$1)))","v":0.7727056670110259},{"$f":" EXP(1*(trust2!$A50-trust2!C$1))/(1+EXP(1*(trust2!$A50-trust2!C$1)))","v":0.804122766043467},{"$f":" EXP(1*(trust2!$A50-trust2!D$1))/(1+EXP(1*(trust2!$A50-trust2!D$1)))","v":0.7473755593975178},{"$f":" EXP(1*(trust2!$A50-trust2!E$1))/(1+EXP(1*(trust2!$A50-trust2!E$1)))","v":0.7582330423879617},{"$f":" EXP(1*(trust2!$A50-trust2!F$1))/(1+EXP(1*(trust2!$A50-trust2!F$1)))","v":0.6282033612754753},{"$f":" EXP(1*(trust2!$A50-trust2!G$1))/(1+EXP(1*(trust2!$A50-trust2!G$1)))","v":0.6411302153394327}]
[1.1919404057633827,{"$f":" EXP(1*(trust2!$A51-trust2!B$1))/(1+EXP(1*(trust2!$A51-trust2!B$1)))","v":0.8054734735428505},{"$f":" EXP(1*(trust2!$A51-trust2!C$1))/(1+EXP(1*(trust2!$A51-trust2!C$1)))","v":0.8333382300989528},{"$f":" EXP(1*(trust2!$A51-trust2!D$1))/(1+EXP(1*(trust2!$A51-trust2!D$1)))","v":0.7827684640358846},{"$f":" EXP(1*(trust2!$A51-trust2!E$1))/(1+EXP(1*(trust2!$A51-trust2!E$1)))","v":0.7925270764240988},{"$f":" EXP(1*(trust2!$A51-trust2!F$1))/(1+EXP(1*(trust2!$A51-trust2!F$1)))","v":0.6729870306140633},{"$f":" EXP(1*(trust2!$A51-trust2!G$1))/(1+EXP(1*(trust2!$A51-trust2!G$1)))","v":0.6851372380246256}]
[0.6673939959076504,{"$f":" EXP(1*(trust2!$A52-trust2!B$1))/(1+EXP(1*(trust2!$A52-trust2!B$1)))","v":0.7101917124122922},{"$f":" EXP(1*(trust2!$A52-trust2!C$1))/(1+EXP(1*(trust2!$A52-trust2!C$1)))","v":0.7474251941112621},{"$f":" EXP(1*(trust2!$A52-trust2!D$1))/(1+EXP(1*(trust2!$A52-trust2!D$1)))","v":0.6807730650310262},{"$f":" EXP(1*(trust2!$A52-trust2!E$1))/(1+EXP(1*(trust2!$A52-trust2!E$1)))","v":0.693318431743057},{"$f":" EXP(1*(trust2!$A52-trust2!F$1))/(1+EXP(1*(trust2!$A52-trust2!F$1)))","v":0.5491358575673321},{"$f":" EXP(1*(trust2!$A52-trust2!G$1))/(1+EXP(1*(trust2!$A52-trust2!G$1)))","v":0.5628989906299277}]
[1.172766136851044,{"$f":" EXP(1*(trust2!$A53-trust2!B$1))/(1+EXP(1*(trust2!$A53-trust2!B$1)))","v":0.8024515272179795},{"$f":" EXP(1*(trust2!$A53-trust2!C$1))/(1+EXP(1*(trust2!$A53-trust2!C$1)))","v":0.830658152136998},{"$f":" EXP(1*(trust2!$A53-trust2!D$1))/(1+EXP(1*(trust2!$A53-trust2!D$1)))","v":0.7794903600342131},{"$f":" EXP(1*(trust2!$A53-trust2!E$1))/(1+EXP(1*(trust2!$A53-trust2!E$1)))","v":0.7893566054559984},{"$f":" EXP(1*(trust2!$A53-trust2!F$1))/(1+EXP(1*(trust2!$A53-trust2!F$1)))","v":0.6687533309932039},{"$f":" EXP(1*(trust2!$A53-trust2!G$1))/(1+EXP(1*(trust2!$A53-trust2!G$1)))","v":0.6809862759380563}]
[0.8850091550559024,{"$f":" EXP(1*(trust2!$A54-trust2!B$1))/(1+EXP(1*(trust2!$A54-trust2!B$1)))","v":0.7528611486072193},{"$f":" EXP(1*(trust2!$A54-trust2!C$1))/(1+EXP(1*(trust2!$A54-trust2!C$1)))","v":0.7862624729918536},{"$f":" EXP(1*(trust2!$A54-trust2!D$1))/(1+EXP(1*(trust2!$A54-trust2!D$1)))","v":0.7261034320486499},{"$f":" EXP(1*(trust2!$A54-trust2!E$1))/(1+EXP(1*(trust2!$A54-trust2!E$1)))","v":0.737554119749149},{"$f":" EXP(1*(trust2!$A54-trust2!F$1))/(1+EXP(1*(trust2!$A54-trust2!F$1)))","v":0.6022370648920988},{"$f":" EXP(1*(trust2!$A54-trust2!G$1))/(1+EXP(1*(trust2!$A54-trust2!G$1)))","v":0.6155141736124119}]
[0.5472073404750945,{"$f":" EXP(1*(trust2!$A55-trust2!B$1))/(1+EXP(1*(trust2!$A55-trust2!B$1)))","v":0.6848451542244167},{"$f":" EXP(1*(trust2!$A55-trust2!C$1))/(1+EXP(1*(trust2!$A55-trust2!C$1)))","v":0.724069848524927},{"$f":" EXP(1*(trust2!$A55-trust2!D$1))/(1+EXP(1*(trust2!$A55-trust2!D$1)))","v":0.6541066933457622},{"$f":" EXP(1*(trust2!$A55-trust2!E$1))/(1+EXP(1*(trust2!$A55-trust2!E$1)))","v":0.667187703358416},{"$f":" EXP(1*(trust2!$A55-trust2!F$1))/(1+EXP(1*(trust2!$A55-trust2!F$1)))","v":0.5192387873942524},{"$f":" EXP(1*(trust2!$A55-trust2!G$1))/(1+EXP(1*(trust2!$A55-trust2!G$1)))","v":0.5331386573694877}]
[0.7650674991108039,{"$f":" EXP(1*(trust2!$A56-trust2!B$1))/(1+EXP(1*(trust2!$A56-trust2!B$1)))","v":0.7298750700711422},{"$f":" EXP(1*(trust2!$A56-trust2!C$1))/(1+EXP(1*(trust2!$A56-trust2!C$1)))","v":0.7654150158132225},{"$f":" EXP(1*(trust2!$A56-trust2!D$1))/(1+EXP(1*(trust2!$A56-trust2!D$1)))","v":0.7016150103969818},{"$f":" EXP(1*(trust2!$A56-trust2!E$1))/(1+EXP(1*(trust2!$A56-trust2!E$1)))","v":0.7136857840039771},{"$f":" EXP(1*(trust2!$A56-trust2!F$1))/(1+EXP(1*(trust2!$A56-trust2!F$1)))","v":0.5731838886561822},{"$f":" EXP(1*(trust2!$A56-trust2!G$1))/(1+EXP(1*(trust2!$A56-trust2!G$1)))","v":0.5867653469403754}]
[1.4883785864706727,{"$f":" EXP(1*(trust2!$A57-trust2!B$1))/(1+EXP(1*(trust2!$A57-trust2!B$1)))","v":0.8477807212812083},{"$f":" EXP(1*(trust2!$A57-trust2!C$1))/(1+EXP(1*(trust2!$A57-trust2!C$1)))","v":0.8705591121320934},{"$f":" EXP(1*(trust2!$A57-trust2!D$1))/(1+EXP(1*(trust2!$A57-trust2!D$1)))","v":0.8289652322112074},{"$f":" EXP(1*(trust2!$A57-trust2!E$1))/(1+EXP(1*(trust2!$A57-trust2!E$1)))","v":0.8370804973327741},{"$f":" EXP(1*(trust2!$A57-trust2!F$1))/(1+EXP(1*(trust2!$A57-trust2!F$1)))","v":0.7346148940816327},{"$f":" EXP(1*(trust2!$A57-trust2!G$1))/(1+EXP(1*(trust2!$A57-trust2!G$1)))","v":0.7453417672621643}]
[1.0469696955709509,{"$f":" EXP(1*(trust2!$A58-trust2!B$1))/(1+EXP(1*(trust2!$A58-trust2!B$1)))","v":0.7817495260301356},{"$f":" EXP(1*(trust2!$A58-trust2!C$1))/(1+EXP(1*(trust2!$A58-trust2!C$1)))","v":0.8122203484703148},{"$f":" EXP(1*(trust2!$A58-trust2!D$1))/(1+EXP(1*(trust2!$A58-trust2!D$1)))","v":0.7571104745070727},{"$f":" EXP(1*(trust2!$A58-trust2!E$1))/(1+EXP(1*(trust2!$A58-trust2!E$1)))","v":0.7676796201964341},{"$f":" EXP(1*(trust2!$A58-trust2!F$1))/(1+EXP(1*(trust2!$A58-trust2!F$1)))","v":0.6403205095131728},{"$f":" EXP(1*(trust2!$A58-trust2!G$1))/(1+EXP(1*(trust2!$A58-trust2!G$1)))","v":0.6530587387881012}]
[1.3674659193320347,{"$f":" EXP(1*(trust2!$A59-trust2!B$1))/(1+EXP(1*(trust2!$A59-trust2!B$1)))","v":0.8315128472889812},{"$f":" EXP(1*(trust2!$A59-trust2!C$1))/(1+EXP(1*(trust2!$A59-trust2!C$1)))","v":0.8563130052121362},{"$f":" EXP(1*(trust2!$A59-trust2!D$1))/(1+EXP(1*(trust2!$A59-trust2!D$1)))","v":0.8111344889635578},{"$f":" EXP(1*(trust2!$A59-trust2!E$1))/(1+EXP(1*(trust2!$A59-trust2!E$1)))","v":0.8199119918923963},{"$f":" EXP(1*(trust2!$A59-trust2!F$1))/(1+EXP(1*(trust2!$A59-trust2!F$1)))","v":0.7103844071326579},{"$f":" EXP(1*(trust2!$A59-trust2!G$1))/(1+EXP(1*(trust2!$A59-trust2!G$1)))","v":0.72171967075003}]
[1.2839967099119989,{"$f":" EXP(1*(trust2!$A60-trust2!B$1))/(1+EXP(1*(trust2!$A60-trust2!B$1)))","v":0.8194932573607291},{"$f":" EXP(1*(trust2!$A60-trust2!C$1))/(1+EXP(1*(trust2!$A60-trust2!C$1)))","v":0.8457343874202318},{"$f":" EXP(1*(trust2!$A60-trust2!D$1))/(1+EXP(1*(trust2!$A60-trust2!D$1)))","v":0.7980142786837208},{"$f":" EXP(1*(trust2!$A60-trust2!E$1))/(1+EXP(1*(trust2!$A60-trust2!E$1)))","v":0.8072566494611036},{"$f":" EXP(1*(trust2!$A60-trust2!F$1))/(1+EXP(1*(trust2!$A60-trust2!F$1)))","v":0.6929149524314295},{"$f":" EXP(1*(trust2!$A60-trust2!G$1))/(1+EXP(1*(trust2!$A60-trust2!G$1)))","v":0.7046496816450464}]
[1.8375608516021993,{"$f":" EXP(1*(trust2!$A61-trust2!B$1))/(1+EXP(1*(trust2!$A61-trust2!B$1)))","v":0.8876024867568737},{"$f":" EXP(1*(trust2!$A61-trust2!C$1))/(1+EXP(1*(trust2!$A61-trust2!C$1)))","v":0.9050889952219189},{"$f":" EXP(1*(trust2!$A61-trust2!D$1))/(1+EXP(1*(trust2!$A61-trust2!D$1)))","v":0.8729717423205002},{"$f":" EXP(1*(trust2!$A61-trust2!E$1))/(1+EXP(1*(trust2!$A61-trust2!E$1)))","v":0.8793029999017364},{"$f":" EXP(1*(trust2!$A61-trust2!F$1))/(1+EXP(1*(trust2!$A61-trust2!F$1)))","v":0.7969511303183501},{"$f":" EXP(1*(trust2!$A61-trust2!G$1))/(1+EXP(1*(trust2!$A61-trust2!G$1)))","v":0.8058243679897796}]
[1.3615195833521427,{"$f":" EXP(1*(trust2!$A62-trust2!B$1))/(1+EXP(1*(trust2!$A62-trust2!B$1)))","v":0.8306781271713336},{"$f":" EXP(1*(trust2!$A62-trust2!C$1))/(1+EXP(1*(trust2!$A62-trust2!C$1)))","v":0.8555798105343768},{"$f":" EXP(1*(trust2!$A62-trust2!D$1))/(1+EXP(1*(trust2!$A62-trust2!D$1)))","v":0.8102218522728467},{"$f":" EXP(1*(trust2!$A62-trust2!E$1))/(1+EXP(1*(trust2!$A62-trust2!E$1)))","v":0.819032306983094},{"$f":" EXP(1*(trust2!$A62-trust2!F$1))/(1+EXP(1*(trust2!$A62-trust2!F$1)))","v":0.7091594886912376},{"$f":" EXP(1*(trust2!$A62-trust2!G$1))/(1+EXP(1*(trust2!$A62-trust2!G$1)))","v":0.720523833234953}]
[-0.06040087073149826,{"$f":" EXP(1*(trust2!$A63-trust2!B$1))/(1+EXP(1*(trust2!$A63-trust2!B$1)))","v":0.5420306917435637},{"$f":" EXP(1*(trust2!$A63-trust2!C$1))/(1+EXP(1*(trust2!$A63-trust2!C$1)))","v":0.5883459693728167},{"$f":" EXP(1*(trust2!$A63-trust2!D$1))/(1+EXP(1*(trust2!$A63-trust2!D$1)))","v":0.5073824388146041},{"$f":" EXP(1*(trust2!$A63-trust2!E$1))/(1+EXP(1*(trust2!$A63-trust2!E$1)))","v":0.5219570074196697},{"$f":" EXP(1*(trust2!$A63-trust2!F$1))/(1+EXP(1*(trust2!$A63-trust2!F$1)))","v":0.3703734488402326},{"$f":" EXP(1*(trust2!$A63-trust2!G$1))/(1+EXP(1*(trust2!$A63-trust2!G$1)))","v":0.3834668352507835}]
[0.808421778035841,{"$f":" EXP(1*(trust2!$A64-trust2!B$1))/(1+EXP(1*(trust2!$A64-trust2!B$1)))","v":0.7383370313840615},{"$f":" EXP(1*(trust2!$A64-trust2!C$1))/(1+EXP(1*(trust2!$A64-trust2!C$1)))","v":0.7731097402495304},{"$f":" EXP(1*(trust2!$A64-trust2!D$1))/(1+EXP(1*(trust2!$A64-trust2!D$1)))","v":0.7106112448400967},{"$f":" EXP(1*(trust2!$A64-trust2!E$1))/(1+EXP(1*(trust2!$A64-trust2!E$1)))","v":0.7224620477636984},{"$f":" EXP(1*(trust2!$A64-trust2!F$1))/(1+EXP(1*(trust2!$A64-trust2!F$1)))","v":0.5837550616791598},{"$f":" EXP(1*(trust2!$A64-trust2!G$1))/(1+EXP(1*(trust2!$A64-trust2!G$1)))","v":0.5972365069816471}]
[2.2059535386245703,{"$f":" EXP(1*(trust2!$A65-trust2!B$1))/(1+EXP(1*(trust2!$A65-trust2!B$1)))","v":0.9194483196080427},{"$f":" EXP(1*(trust2!$A65-trust2!C$1))/(1+EXP(1*(trust2!$A65-trust2!C$1)))","v":0.9323579074949285},{"$f":" EXP(1*(trust2!$A65-trust2!D$1))/(1+EXP(1*(trust2!$A65-trust2!D$1)))","v":0.908535771493588},{"$f":" EXP(1*(trust2!$A65-trust2!E$1))/(1+EXP(1*(trust2!$A65-trust2!E$1)))","v":0.9132705735388333},{"$f":" EXP(1*(trust2!$A65-trust2!F$1))/(1+EXP(1*(trust2!$A65-trust2!F$1)))","v":0.8501450759561465},{"$f":" EXP(1*(trust2!$A65-trust2!G$1))/(1+EXP(1*(trust2!$A65-trust2!G$1)))","v":0.8571105228719655}]
[1.4075824996494697,{"$f":" EXP(1*(trust2!$A66-trust2!B$1))/(1+EXP(1*(trust2!$A66-trust2!B$1)))","v":0.8370586511060938},{"$f":" EXP(1*(trust2!$A66-trust2!C$1))/(1+EXP(1*(trust2!$A66-trust2!C$1)))","v":0.8611787867580796},{"$f":" EXP(1*(trust2!$A66-trust2!D$1))/(1+EXP(1*(trust2!$A66-trust2!D$1)))","v":0.8172035953268274},{"$f":" EXP(1*(trust2!$A66-trust2!E$1))/(1+EXP(1*(trust2!$A66-trust2!E$1)))","v":0.8257596269619829},{"$f":" EXP(1*(trust2!$A66-trust2!F$1))/(1+EXP(1*(trust2!$A66-trust2!F$1)))","v":0.7185677640377739},{"$f":" EXP(1*(trust2!$A66-trust2!G$1))/(1+EXP(1*(trust2!$A66-trust2!G$1)))","v":0.7297046063583871}]
[2.376023331662253,{"$f":" EXP(1*(trust2!$A67-trust2!B$1))/(1+EXP(1*(trust2!$A67-trust2!B$1)))","v":0.9311791323656179},{"$f":" EXP(1*(trust2!$A67-trust2!C$1))/(1+EXP(1*(trust2!$A67-trust2!C$1)))","v":0.9423266127097828},{"$f":" EXP(1*(trust2!$A67-trust2!D$1))/(1+EXP(1*(trust2!$A67-trust2!D$1)))","v":0.9217204874957305},{"$f":" EXP(1*(trust2!$A67-trust2!E$1))/(1+EXP(1*(trust2!$A67-trust2!E$1)))","v":0.9258284808808798},{"$f":" EXP(1*(trust2!$A67-trust2!F$1))/(1+EXP(1*(trust2!$A67-trust2!F$1)))","v":0.8705475954452997},{"$f":" EXP(1*(trust2!$A67-trust2!G$1))/(1+EXP(1*(trust2!$A67-trust2!G$1)))","v":0.8767022457570337}]
[1.2197263747274443,{"$f":" EXP(1*(trust2!$A68-trust2!B$1))/(1+EXP(1*(trust2!$A68-trust2!B$1)))","v":0.8097902268818951},{"$f":" EXP(1*(trust2!$A68-trust2!C$1))/(1+EXP(1*(trust2!$A68-trust2!C$1)))","v":0.8371616428285948},{"$f":" EXP(1*(trust2!$A68-trust2!D$1))/(1+EXP(1*(trust2!$A68-trust2!D$1)))","v":0.7874561132208119},{"$f":" EXP(1*(trust2!$A68-trust2!E$1))/(1+EXP(1*(trust2!$A68-trust2!E$1)))","v":0.7970587396295626},{"$f":" EXP(1*(trust2!$A68-trust2!F$1))/(1+EXP(1*(trust2!$A68-trust2!F$1)))","v":0.6790723997448462},{"$f":" EXP(1*(trust2!$A68-trust2!G$1))/(1+EXP(1*(trust2!$A68-trust2!G$1)))","v":0.6911002851772378}]
[1.0152434672211184,{"$f":" EXP(1*(trust2!$A69-trust2!B$1))/(1+EXP(1*(trust2!$A69-trust2!B$1)))","v":0.7762881250861238},{"$f":" EXP(1*(trust2!$A69-trust2!C$1))/(1+EXP(1*(trust2!$A69-trust2!C$1)))","v":0.8073335161899826},{"$f":" EXP(1*(trust2!$A69-trust2!D$1))/(1+EXP(1*(trust2!$A69-trust2!D$1)))","v":0.7512287200242573},{"$f":" EXP(1*(trust2!$A69-trust2!E$1))/(1+EXP(1*(trust2!$A69-trust2!E$1)))","v":0.7619733411066612},{"$f":" EXP(1*(trust2!$A69-trust2!F$1))/(1+EXP(1*(trust2!$A69-trust2!F$1)))","v":0.6329815807915031},{"$f":" EXP(1*(trust2!$A69-trust2!G$1))/(1+EXP(1*(trust2!$A69-trust2!G$1)))","v":0.6458359635444898}]
[0.8645462153754336,{"$f":" EXP(1*(trust2!$A70-trust2!B$1))/(1+EXP(1*(trust2!$A70-trust2!B$1)))","v":0.7490341201002214},{"$f":" EXP(1*(trust2!$A70-trust2!C$1))/(1+EXP(1*(trust2!$A70-trust2!C$1)))","v":0.7828034568621779},{"$f":" EXP(1*(trust2!$A70-trust2!D$1))/(1+EXP(1*(trust2!$A70-trust2!D$1)))","v":0.7220150458803286},{"$f":" EXP(1*(trust2!$A70-trust2!E$1))/(1+EXP(1*(trust2!$A70-trust2!E$1)))","v":0.7335739396264327},{"$f":" EXP(1*(trust2!$A70-trust2!F$1))/(1+EXP(1*(trust2!$A70-trust2!F$1)))","v":0.5973251124047744},{"$f":" EXP(1*(trust2!$A70-trust2!G$1))/(1+EXP(1*(trust2!$A70-trust2!G$1)))","v":0.6106601821320553}]
[0.49062154673352243,{"$f":" EXP(1*(trust2!$A71-trust2!B$1))/(1+EXP(1*(trust2!$A71-trust2!B$1)))","v":0.6725063470421814},{"$f":" EXP(1*(trust2!$A71-trust2!C$1))/(1+EXP(1*(trust2!$A71-trust2!C$1)))","v":0.7126223291672554},{"$f":" EXP(1*(trust2!$A71-trust2!D$1))/(1+EXP(1*(trust2!$A71-trust2!D$1)))","v":0.6411949451183419},{"$f":" EXP(1*(trust2!$A71-trust2!E$1))/(1+EXP(1*(trust2!$A71-trust2!E$1)))","v":0.6545063378162134},{"$f":" EXP(1*(trust2!$A71-trust2!F$1))/(1+EXP(1*(trust2!$A71-trust2!F$1)))","v":0.5051016648435173},{"$f":" EXP(1*(trust2!$A71-trust2!G$1))/(1+EXP(1*(trust2!$A71-trust2!G$1)))","v":0.5190316606305085}]
[0.9462025279712573,{"$f":" EXP(1*(trust2!$A72-trust2!B$1))/(1+EXP(1*(trust2!$A72-trust2!B$1)))","v":0.7640699276942862},{"$f":" EXP(1*(trust2!$A72-trust2!C$1))/(1+EXP(1*(trust2!$A72-trust2!C$1)))","v":0.7963661098593476},{"$f":" EXP(1*(trust2!$A72-trust2!D$1))/(1+EXP(1*(trust2!$A72-trust2!D$1)))","v":0.7381036215825667},{"$f":" EXP(1*(trust2!$A72-trust2!E$1))/(1+EXP(1*(trust2!$A72-trust2!E$1)))","v":0.7492258895822569},{"$f":" EXP(1*(trust2!$A72-trust2!F$1))/(1+EXP(1*(trust2!$A72-trust2!F$1)))","v":0.6168001353546811},{"$f":" EXP(1*(trust2!$A72-trust2!G$1))/(1+EXP(1*(trust2!$A72-trust2!G$1)))","v":0.6298898783179063}]
[1.146645141148366,{"$f":" EXP(1*(trust2!$A73-trust2!B$1))/(1+EXP(1*(trust2!$A73-trust2!B$1)))","v":0.7982780118202317},{"$f":" EXP(1*(trust2!$A73-trust2!C$1))/(1+EXP(1*(trust2!$A73-trust2!C$1)))","v":0.8269520379765536},{"$f":" EXP(1*(trust2!$A73-trust2!D$1))/(1+EXP(1*(trust2!$A73-trust2!D$1)))","v":0.7749677888801568},{"$f":" EXP(1*(trust2!$A73-trust2!E$1))/(1+EXP(1*(trust2!$A73-trust2!E$1)))","v":0.7849805690338248},{"$f":" EXP(1*(trust2!$A73-trust2!F$1))/(1+EXP(1*(trust2!$A73-trust2!F$1)))","v":0.6629416601670146},{"$f":" EXP(1*(trust2!$A73-trust2!G$1))/(1+EXP(1*(trust2!$A73-trust2!G$1)))","v":0.6752850184160106}]
[1.5789050882186244,{"$f":" EXP(1*(trust2!$A74-trust2!B$1))/(1+EXP(1*(trust2!$A74-trust2!B$1)))","v":0.8590989717678128},{"$f":" EXP(1*(trust2!$A74-trust2!C$1))/(1+EXP(1*(trust2!$A74-trust2!C$1)))","v":0.8804225676787597},{"$f":" EXP(1*(trust2!$A74-trust2!D$1))/(1+EXP(1*(trust2!$A74-trust2!D$1)))","v":0.8414208162571636},{"$f":" EXP(1*(trust2!$A74-trust2!E$1))/(1+EXP(1*(trust2!$A74-trust2!E$1)))","v":0.8490527029420644},{"$f":" EXP(1*(trust2!$A74-trust2!F$1))/(1+EXP(1*(trust2!$A74-trust2!F$1)))","v":0.7518849758799073},{"$f":" EXP(1*(trust2!$A74-trust2!G$1))/(1+EXP(1*(trust2!$A74-trust2!G$1)))","v":0.7621398150850378}]
[1.0918094707806074,{"$f":" EXP(1*(trust2!$A75-trust2!B$1))/(1+EXP(1*(trust2!$A75-trust2!B$1)))","v":0.7893032667121259},{"$f":" EXP(1*(trust2!$A75-trust2!C$1))/(1+EXP(1*(trust2!$A75-trust2!C$1)))","v":0.818963705588847},{"$f":" EXP(1*(trust2!$A75-trust2!D$1))/(1+EXP(1*(trust2!$A75-trust2!D$1)))","v":0.7652609190587643},{"$f":" EXP(1*(trust2!$A75-trust2!E$1))/(1+EXP(1*(trust2!$A75-trust2!E$1)))","v":0.7755805314511802},{"$f":" EXP(1*(trust2!$A75-trust2!F$1))/(1+EXP(1*(trust2!$A75-trust2!F$1)))","v":0.6505812857448139},{"$f":" EXP(1*(trust2!$A75-trust2!G$1))/(1+EXP(1*(trust2!$A75-trust2!G$1)))","v":0.6631472929473375}]
[1.5740673965772978,{"$f":" EXP(1*(trust2!$A76-trust2!B$1))/(1+EXP(1*(trust2!$A76-trust2!B$1)))","v":0.8585123612944416},{"$f":" EXP(1*(trust2!$A76-trust2!C$1))/(1+EXP(1*(trust2!$A76-trust2!C$1)))","v":0.8799123238961428},{"$f":" EXP(1*(trust2!$A76-trust2!D$1))/(1+EXP(1*(trust2!$A76-trust2!D$1)))","v":0.8407742475575568},{"$f":" EXP(1*(trust2!$A76-trust2!E$1))/(1+EXP(1*(trust2!$A76-trust2!E$1)))","v":0.848431646176233},{"$f":" EXP(1*(trust2!$A76-trust2!F$1))/(1+EXP(1*(trust2!$A76-trust2!F$1)))","v":0.7509813860523864},{"$f":" EXP(1*(trust2!$A76-trust2!G$1))/(1+EXP(1*(trust2!$A76-trust2!G$1)))","v":0.7612617133450268}]
[1.1548192164041773,{"$f":" EXP(1*(trust2!$A77-trust2!B$1))/(1+EXP(1*(trust2!$A77-trust2!B$1)))","v":0.7995910762645166},{"$f":" EXP(1*(trust2!$A77-trust2!C$1))/(1+EXP(1*(trust2!$A77-trust2!C$1)))","v":0.8281186431925304},{"$f":" EXP(1*(trust2!$A77-trust2!D$1))/(1+EXP(1*(trust2!$A77-trust2!D$1)))","v":0.7763900833783661},{"$f":" EXP(1*(trust2!$A77-trust2!E$1))/(1+EXP(1*(trust2!$A77-trust2!E$1)))","v":0.7863570250621005},{"$f":" EXP(1*(trust2!$A77-trust2!F$1))/(1+EXP(1*(trust2!$A77-trust2!F$1)))","v":0.6647657177947945},{"$f":" EXP(1*(trust2!$A77-trust2!G$1))/(1+EXP(1*(trust2!$A77-trust2!G$1)))","v":0.6770748157201023}]
[0.8835289764406602,{"$f":" EXP(1*(trust2!$A78-trust2!B$1))/(1+EXP(1*(trust2!$A78-trust2!B$1)))","v":0.7525856416730075},{"$f":" EXP(1*(trust2!$A78-trust2!C$1))/(1+EXP(1*(trust2!$A78-trust2!C$1)))","v":0.7860136179566618},{"$f":" EXP(1*(trust2!$A78-trust2!D$1))/(1+EXP(1*(trust2!$A78-trust2!D$1)))","v":0.7258089597155684},{"$f":" EXP(1*(trust2!$A78-trust2!E$1))/(1+EXP(1*(trust2!$A78-trust2!E$1)))","v":0.7372675037471516},{"$f":" EXP(1*(trust2!$A78-trust2!F$1))/(1+EXP(1*(trust2!$A78-trust2!F$1)))","v":0.6018824380824421},{"$f":" EXP(1*(trust2!$A78-trust2!G$1))/(1+EXP(1*(trust2!$A78-trust2!G$1)))","v":0.6151638199178583}]
[0.5583810167619204,{"$f":" EXP(1*(trust2!$A79-trust2!B$1))/(1+EXP(1*(trust2!$A79-trust2!B$1)))","v":0.6872517984080442},{"$f":" EXP(1*(trust2!$A79-trust2!C$1))/(1+EXP(1*(trust2!$A79-trust2!C$1)))","v":0.7262966690892473},{"$f":" EXP(1*(trust2!$A79-trust2!D$1))/(1+EXP(1*(trust2!$A79-trust2!D$1)))","v":0.6566303783123104},{"$f":" EXP(1*(trust2!$A79-trust2!E$1))/(1+EXP(1*(trust2!$A79-trust2!E$1)))","v":0.6696641468553195},{"$f":" EXP(1*(trust2!$A79-trust2!F$1))/(1+EXP(1*(trust2!$A79-trust2!F$1)))","v":0.5220274422573256},{"$f":" EXP(1*(trust2!$A79-trust2!G$1))/(1+EXP(1*(trust2!$A79-trust2!G$1)))","v":0.535918747500038}]
[0.3904412506235353,{"$f":" EXP(1*(trust2!$A80-trust2!B$1))/(1+EXP(1*(trust2!$A80-trust2!B$1)))","v":0.650073563172146},{"$f":" EXP(1*(trust2!$A80-trust2!C$1))/(1+EXP(1*(trust2!$A80-trust2!C$1)))","v":0.6916776111058293},{"$f":" EXP(1*(trust2!$A80-trust2!D$1))/(1+EXP(1*(trust2!$A80-trust2!D$1)))","v":0.6178361909020142},{"$f":" EXP(1*(trust2!$A80-trust2!E$1))/(1+EXP(1*(trust2!$A80-trust2!E$1)))","v":0.6315161598549232},{"$f":" EXP(1*(trust2!$A80-trust2!F$1))/(1+EXP(1*(trust2!$A80-trust2!F$1)))","v":0.4800673372379875},{"$f":" EXP(1*(trust2!$A80-trust2!G$1))/(1+EXP(1*(trust2!$A80-trust2!G$1)))","v":0.4939960743191868}]
[1.2710438511269417,{"$f":" EXP(1*(trust2!$A81-trust2!B$1))/(1+EXP(1*(trust2!$A81-trust2!B$1)))","v":0.8175692827374026},{"$f":" EXP(1*(trust2!$A81-trust2!C$1))/(1+EXP(1*(trust2!$A81-trust2!C$1)))","v":0.8440368791633762},{"$f":" EXP(1*(trust2!$A81-trust2!D$1))/(1+EXP(1*(trust2!$A81-trust2!D$1)))","v":0.7959183787345359},{"$f":" EXP(1*(trust2!$A81-trust2!E$1))/(1+EXP(1*(trust2!$A81-trust2!E$1)))","v":0.8052332461973999},{"$f":" EXP(1*(trust2!$A81-trust2!F$1))/(1+EXP(1*(trust2!$A81-trust2!F$1)))","v":0.6901519280296408},{"$f":" EXP(1*(trust2!$A81-trust2!G$1))/(1+EXP(1*(trust2!$A81-trust2!G$1)))","v":0.7019468250645086}]

{"sheet":"var","index":10,"n_rows":81,"n_cols":26,"rows_kept":81}
[{"$f":"AVERAGE(trust2!B1:'trust2'!G1)","v":0},{"$f":"SUMSQ(B2:B81)/80","v":0.8107957184723921},{"$f":"SUMSQ(C2:C81)/80","v":0.8834670937557577},{"$f":"SUMSQ(D2:D81)/80","v":0.9765016779401243},{"$f":"SUMSQ(E2:E81)/80","v":0.8097273709597979},{"$f":"SUMSQ(F2:F81)/80","v":0.9190532039809345},{"$f":"SUMSQ(G2:G81)/80","v":1.5879549348909783},{"$f":"SUMSQ(H2:H81)/80","v":0},0,{"$f":"SUMSQ(J2:J76)/75","v":0},0,0,0,0,0,0,0,0,0,0,0,0,0,0,0,0]
[{"$f":"SUMSQ(B2:G2)/6","v":0.7586785373737212},{"v":-1.169680438804415,"d":"-1.17"},{"v":0.883077248368364,"d":"0.88"},{"v":-0.9193776489665128,"d":"-0.92"},{"v":-0.5286914066255058,"d":"-0.53"},{"v":1.0367212586030856,"d":"1.04"},{"v":0.4522528450285104,"d":"0.45"}]
[{"$f":"SUMSQ(B3:G3)/6","v":0.1451791873612854},{"v":-0.37768885828036614,"d":"-0.38"},{"v":0.5653088277417495,"d":"0.57"},{"v":-0.11659923611354832,"d":"-0.12"},{"v":-0.4640794568628131,"d":"-0.46"},{"v":0.40776029183200835,"d":"0.41"},{"v":-0.11669875764790182,"d":"-0.12"}]
[1.0185768021652521,{"v":-0.4098428958226868,"d":"-0.41"},{"v":0.6730887057070116,"d":"0.67"},{"v":-0.7405753913849044,"d":"-0.74"},{"v":-1.5958640178692696,"d":"-1.60"},{"v":0.3511069204870051,"d":"0.35"},{"v":1.5072926937115518,"d":"1.51"}]
[2.4220017918802754,{"v":-1.2037795651757308,"d":"-1.20"},{"v":1.3012950075059178,"d":"1.30"},{"v":-2.7148901511388974,"d":"-2.71"},{"v":-0.188286702817868,"d":"-0.19"},{"v":0.8540894582278029,"d":"0.85"},{"v":1.8038868022473813,"d":"1.80"}]
[1.647444617116336,{"v":-0.9846104861238256,"d":"-0.98"},{"v":0.9403133111722096,"d":"0.94"},{"v":-1.688506612324052,"d":"-1.69"},{"v":-1.1752607032067555,"d":"-1.18"},{"v":0.9700534088001964,"d":"0.97"},{"v":1.6904806576404268,"d":"1.69"}]
[0.9637240491826292,{"v":-0.8649208080876313,"d":"-0.86"},{"v":-0.21937126732689818,"d":"-0.22"},{"v":-0.7651607196842934,"d":"-0.77"},{"v":-1.0293915710697106,"d":"-1.03"},{"v":1.1972021032097604,"d":"1.20"},{"v":1.3812030004446045,"d":"1.38"}]
[0.8903101376901192,{"v":-1.3027033014157179,"d":"-1.30"},{"v":1.0676366600600855,"d":"1.07"},{"v":-1.1339768981127976,"d":"-1.13"},{"v":-0.3032227825907856,"d":"-0.30"},{"v":0.5325949425275923,"d":"0.53"},{"v":0.9184072422272485,"d":"0.92"}]
[1.2379759024318637,{"v":-1.493969284623691,"d":"-1.49"},{"v":0.49258061910397993,"d":"0.49"},{"v":-0.8429090491745285,"d":"-0.84"},{"v":-0.8851889512253539,"d":"-0.89"},{"v":0.75256985372126,"d":"0.75"},{"v":1.7008406731947323,"d":"1.70"}]
[2.646276270199797,{"v":-1.4014689032515806,"d":"-1.40"},{"v":0.9118533254160659,"d":"0.91"},{"v":-2.0031890184675936,"d":"-2.00"},{"v":-1.5437251485604742,"d":"-1.54"},{"v":2.0443804915058834,"d":"2.04"},{"v":1.5832627309730374,"d":"1.58"}]
[0.15168400605221427,{"v":0.607473933177993,"d":"0.61"},{"v":0.052532227080127766,"d":"0.05"},{"v":0.30176647943566304,"d":"0.30"},{"v":-0.5511707895593054,"d":"-0.55"},{"v":-0.3762994830131312,"d":"-0.38"},{"v":-0.0432003894678552,"d":"-0.04"}]
[0.9105162459838855,{"v":0.3164446820286345,"d":"0.32"},{"v":1.307005629773823,"d":"1.31"},{"v":-0.3633399305168941,"d":"-0.36"},{"v":-0.5468441849133969,"d":"-0.55"},{"v":-1.565390766611527,"d":"-1.57"},{"v":0.8793143937093251,"d":"0.88"}]
[0.6654156661592182,{"v":-0.9416954647060238,"d":"-0.94"},{"v":0.8853146042088057,"d":"0.89"},{"v":-0.8511402534123863,"d":"-0.85"},{"v":-0.704616078652525,"d":"-0.70"},{"v":0.4970289151791996,"d":"0.50"},{"v":0.9240997827525153,"d":"0.92"}]
[2.156001582855338,{"v":-1.8573782757940998,"d":"-1.86"},{"v":1.4540036274669887,"d":"1.45"},{"v":-1.449391385128269,"d":"-1.45"},{"v":-1.1661073330295253,"d":"-1.17"},{"v":1.049390001507312,"d":"1.05"},{"v":1.6763853418472174,"d":"1.68"}]
[0.05026765136470467,{"v":0.13554093565025216,"d":"0.14"},{"v":-0.41314447321686937,"d":"-0.41"},{"v":0.1383536084644107,"d":"0.14"},{"v":0.2632986146411188,"d":"0.26"},{"v":-0.08596802060302443,"d":"-0.09"},{"v":-0.12918136548349293,"d":"-0.13"}]
[0.4721772941950444,{"v":0.6933871137858978,"d":"0.69"},{"v":-0.501669589958985,"d":"-0.50"},{"v":0.6731568814668885,"d":"0.67"},{"v":0.6996837137045158,"d":"0.70"},{"v":-0.6229230369777772,"d":"-0.62"},{"v":-0.8774252685152887,"d":"-0.88"}]
[0.4261981449902595,{"v":0.33293773830920065,"d":"0.33"},{"v":-0.583731149590416,"d":"-0.58"},{"v":0.6417116068597319,"d":"0.64"},{"v":0.8343456720548222,"d":"0.83"},{"v":-0.9628512969954982,"d":"-0.96"},{"v":-0.2656881073137022,"d":"-0.27"}]
[0.9577278653827808,{"v":1.233603058483593,"d":"1.23"},{"v":0.46825310645513807,"d":"0.47"},{"v":0.7541584253529435,"d":"0.75"},{"v":0.34771490119174964,"d":"0.35"},{"v":-1.5961009530058223,"d":"-1.60"},{"v":-0.8764307613633883,"d":"-0.88"}]
[0.9654019877851464,{"v":0.6435466070037816,"d":"0.64"},{"v":0.45190268053988414,"d":"0.45"},{"v":1.0326880723366256,"d":"1.03"},{"v":0.8292655743559164,"d":"0.83"},{"v":-1.0270507272194012,"d":"-1.03"},{"v":-1.537883095298723,"d":"-1.54"}]
[0.302034695930452,{"v":0.6963204795895275,"d":"0.70"},{"v":-0.8639149124734522,"d":"-0.86"},{"v":0.5101182919008733,"d":"0.51"},{"v":0.28361142904611775,"d":"0.28"},{"v":-0.31917946190222785,"d":"-0.32"},{"v":-0.3721093199252982,"d":"-0.37"}]
[0.6252900823335715,{"v":1.0830499464208863,"d":"1.08"},{"v":-0.6243178851296521,"d":"-0.62"},{"v":0.6465450554364844,"d":"0.65"},{"v":0.623614798745083,"d":"0.62"},{"v":-0.8233707744371541,"d":"-0.82"},{"v":-0.8391156819806831,"d":"-0.84"}]
[1.1907774966975675,{"v":0.8875117114547495,"d":"0.89"},{"v":0.3095542339126609,"d":"0.31"},{"v":0.9407332668825091,"d":"0.94"},{"v":1.1389211142011992,"d":"1.14"},{"v":-1.4858514603657058,"d":"-1.49"},{"v":-1.367950720025825,"d":"-1.37"}]
[0.29802394267442184,{"v":0.2984421852912596,"d":"0.30"},{"v":0.10288437817694032,"d":"0.10"},{"v":0.5871322257540309,"d":"0.59"},{"v":0.5632202646880448,"d":"0.56"},{"v":-0.6723594742935018,"d":"-0.67"},{"v":-0.7579460027375733,"d":"-0.76"}]
[0.19918607400542995,{"v":0.42716451752680085,"d":"0.43"},{"v":-0.32058460006431816,"d":"-0.32"},{"v":0.3619096442481053,"d":"0.36"},{"v":0.46803394038071566,"d":"0.47"},{"v":-0.7257230811655636,"d":"-0.73"},{"v":-0.18211008405837342,"d":"-0.18"}]
[0.5982734908334945,{"v":0.6547129148042415,"d":"0.65"},{"v":0.1483194892578933,"d":"0.15"},{"v":0.721599241242112,"d":"0.72"},{"v":0.7119101240920381,"d":"0.71"},{"v":-0.8551180485333586,"d":"-0.86"},{"v":-1.1748382470035381,"d":"-1.17"}]
[0.28377408912494106,{"v":0.2188876698454947,"d":"0.22"},{"v":-0.6248006691774031,"d":"-0.62"},{"v":0.5718547794790779,"d":"0.57"},{"v":0.6342389412370135,"d":"0.63"},{"v":-0.7235940446909885,"d":"-0.72"},{"v":-0.10719879489970353,"d":"-0.11"}]
[1.6795271198425905,{"v":-1.6386433045378288,"d":"-1.64"},{"v":-0.4925457805129894,"d":"-0.49"},{"v":-0.604160356867509,"d":"-0.60"},{"v":-0.8066263676625705,"d":"-0.81"},{"v":0.8421436407192701,"d":"0.84"},{"v":2.3290658531319037,"d":"2.33"}]
[0.37225092045885094,{"v":0.6908766942613761,"d":"0.69"},{"v":-0.5178089822589427,"d":"-0.52"},{"v":0.6819496450820275,"d":"0.68"},{"v":-0.1709326378838764,"d":"-0.17"},{"v":-0.9657626182579362,"d":"-0.97"},{"v":0.24718020557008344,"d":"0.25"}]
[0.3872364398944777,{"v":0.33707764384747574,"d":"0.34"},{"v":-0.43936015020687835,"d":"-0.44"},{"v":0.6581040899899835,"d":"0.66"},{"v":0.6994289296241339,"d":"0.70"},{"v":-1.0309784735012018,"d":"-1.03"},{"v":-0.17759934154077325,"d":"-0.18"}]
[1.1568213359224264,{"v":0.5901233674137033,"d":"0.59"},{"v":-0.6441262776198303,"d":"-0.64"},{"v":1.1779258036298492,"d":"1.18"},{"v":1.4289294530263053,"d":"1.43"},{"v":-1.3069537569653344,"d":"-1.31"},{"v":-1.0199544410499948,"d":"-1.02"}]
[0.4573661930251374,{"v":0.609170436920903,"d":"0.61"},{"v":-1.1356022504260825,"d":"-1.14"},{"v":0.5568087145668373,"d":"0.56"},{"v":0.6682902760157553,"d":"0.67"},{"v":-0.5138499008235916,"d":"-0.51"},{"v":-0.2506521644599039,"d":"-0.25"}]
[0.12625568471155796,{"v":-0.04898129015644778,"d":"-0.05"},{"v":-0.595007098044295,"d":"-0.60"},{"v":0.1757249299417356,"d":"0.18"},{"v":0.3053410627357537,"d":"0.31"},{"v":-0.35582106413599063,"d":"-0.36"},{"v":0.3877891817500435,"d":"0.39"}]
[0.680324105011837,{"v":0.19007820624064717,"d":"0.19"},{"v":0.5915614675564966,"d":"0.59"},{"v":0.891676766975488,"d":"0.89"},{"v":0.7648328843387755,"d":"0.76"},{"v":-0.8293506042659019,"d":"-0.83"},{"v":-1.275927393373039,"d":"-1.28"}]
[0.32103965241524707,{"v":-0.10637363312589868,"d":"-0.11"},{"v":0.333970141240214,"d":"0.33"},{"v":0.6032903010332064,"d":"0.60"},{"v":0.7084369611610108,"d":"0.71"},{"v":-0.6422325877480944,"d":"-0.64"},{"v":-0.7246252116795777,"d":"-0.72"}]
[0.49704678022009685,{"v":0.49058019871051994,"d":"0.49"},{"v":-0.12150703539598,"d":"-0.12"},{"v":0.8017054832396335,"d":"0.80"},{"v":0.6678766344081453,"d":"0.67"},{"v":-1.1633362988004994,"d":"-1.16"},{"v":-0.5335780782147236,"d":"-0.53"}]
[0.5181018287080887,{"v":0.5721627583370833,"d":"0.57"},{"v":0.5254371764943995,"d":"0.53"},{"v":0.4732607965545327,"d":"0.47"},{"v":0.5572349603220397,"d":"0.56"},{"v":-1.278280989074895,"d":"-1.28"},{"v":-0.5802306904907724,"d":"-0.58"}]
[0.1125685664379114,{"v":0.25155660861016743,"d":"0.25"},{"v":-0.3760828412332903,"d":"-0.38"},{"v":0.5681117467052494,"d":"0.57"},{"v":-0.031911941906819535,"d":"-0.03"},{"v":-0.1034555709586875,"d":"-0.10"},{"v":-0.369079915301244,"d":"-0.37"}]
[3.154935395332629,{"v":-1.284458451013666,"d":"-1.28"},{"v":1.386486254288916,"d":"1.39"},{"v":-2.3128519591153904,"d":"-2.31"},{"v":-1.7414079421451418,"d":"-1.74"},{"v":1.6941662775499902,"d":"1.69"},{"v":2.0261908953861116,"d":"2.03"}]
[4.549914903100174,{"v":-2.7660936347047613,"d":"-2.77"},{"v":-0.7612175430524545,"d":"-0.76"},{"v":-2.404522304840165,"d":"-2.40"},{"v":0.7504623433416238,"d":"0.75"},{"v":1.7891760984502294,"d":"1.79"},{"v":3.085885759434848,"d":"3.09"}]
[1.534549906298702,{"v":-1.133419190324927,"d":"-1.13"},{"v":0.33966328985754213,"d":"0.34"},{"v":-1.580923643257836,"d":"-1.58"},{"v":-0.8867944386808689,"d":"-0.89"},{"v":1.4415004727619771,"d":"1.44"},{"v":1.5632151710684616,"d":"1.56"}]
[0.05827640071708343,{"v":0.3019129597311092,"d":"0.30"},{"v":-0.31119782058980616,"d":"-0.31"},{"v":0.14982518032623485,"d":"0.15"},{"v":0.11033176330559233,"d":"0.11"},{"v":0.03723447776346257,"d":"0.04"},{"v":-0.3544796136886143,"d":"-0.35"}]
[0.1039767897213552,{"v":0.03338480135397845,"d":"0.03"},{"v":-0.4903685758334792,"d":"-0.49"},{"v":0.38297208654093806,"d":"0.38"},{"v":0.12554900048866025,"d":"0.13"},{"v":0.2386211901524007,"d":"0.24"},{"v":-0.40362682048987075,"d":"-0.40"}]
[0.1928058423616563,{"v":0.13463664362977476,"d":"0.13"},{"v":-0.9075103333827379,"d":"-0.91"},{"v":-0.05402472614993047,"d":"-0.05"},{"v":-0.14132379643408055,"d":"-0.14"},{"v":0.3896583614120149,"d":"0.39"},{"v":0.3747109526997921,"d":"0.37"}]
[0.08503237011407917,{"v":0.1575068998004391,"d":"0.16"},{"v":-0.4615338039515731,"d":"-0.46"},{"v":0.029930326224131786,"d":"0.03"},{"v":-0.2766982837325249,"d":"-0.28"},{"v":0.43933673014906804,"d":"0.44"},{"v":-0.04356395187810165,"d":"-0.04"}]
[0.13211876950833384,{"v":0.6762491079430727,"d":"0.68"},{"v":0.12312395032730528,"d":"0.12"},{"v":-0.30864879105347826,"d":"-0.31"},{"v":0.12707131156645876,"d":"0.13"},{"v":-0.22091436672833875,"d":"-0.22"},{"v":-0.40003237624350374,"d":"-0.40"}]
[0.5212373831893057,{"v":0.891810194051674,"d":"0.89"},{"v":-1.280578802428054,"d":"-1.28"},{"v":0.32788421067836987,"d":"0.33"},{"v":0.4189817619710156,"d":"0.42"},{"v":-0.6190765295306198,"d":"-0.62"},{"v":0.1609574036852288,"d":"0.16"}]
[0.40259596880481735,{"v":-0.2188860431837229,"d":"-0.22"},{"v":-0.4527798716750214,"d":"-0.45"},{"v":-0.636479662138039,"d":"-0.64"},{"v":-0.6041470159071163,"d":"-0.60"},{"v":0.6362625752079795,"d":"0.64"},{"v":0.9938435787281182,"d":"0.99"}]
[0.37626214013306636,{"v":-0.4276085963376911,"d":"-0.43"},{"v":-1.16891333252352,"d":"-1.17"},{"v":0.45350273865048085,"d":"0.45"},{"v":-0.11662812588770642,"d":"-0.12"},{"v":0.632947860334113,"d":"0.63"},{"v":0.2974483191617833,"d":"0.30"}]
[0.43147704397917225,{"v":0.48128520205992964,"d":"0.48"},{"v":-1.3676569084892514,"d":"-1.37"},{"v":0.6078312961873183,"d":"0.61"},{"v":0.20299721009721636,"d":"0.20"},{"v":-0.2388984117746815,"d":"-0.24"},{"v":0.13784845205629112,"d":"0.14"}]
[0.06169395891085053,{"v":0.14629766718176898,"d":"0.15"},{"v":-0.4900418561573711,"d":"-0.49"},{"v":-0.004557719691016678,"d":"-0.00"},{"v":0.15641593350848806,"d":"0.16"},{"v":0.23344161075640948,"d":"0.23"},{"v":-0.17215697069666758,"d":"-0.17"}]
[1.2487056200035063,{"v":0.9773813233073813,"d":"0.98"},{"v":-1.6808826604387548,"d":"-1.68"},{"v":1.1891765055330705,"d":"1.19"},{"v":1.0536176092108145,"d":"1.05"},{"v":-0.6773719722042044,"d":"-0.68"},{"v":-0.85352758258214,"d":"-0.85"}]
[0.3299733908459838,{"v":-0.5618260575761778,"d":"-0.56"},{"v":-1.0014456307684483,"d":"-1.00"},{"v":0.5132878514859481,"d":"0.51"},{"v":0.42513025632856427,"d":"0.43"},{"v":0.4646694936009541,"d":"0.46"},{"v":-0.0343596144722016,"d":"-0.03"}]
[0.689314516061363,{"v":1.1661022466235929,"d":"1.17"},{"v":0.10363408908752542,"d":"0.10"},{"v":0.012932721142473139,"d":"0.01"},{"v":0.8497670822422829,"d":"0.85"},{"v":-0.6169187770696092,"d":"-0.62"},{"v":-1.2893767857095972,"d":"-1.29"}]
[0.7890514247490986,{"v":0.27775783373006246,"d":"0.28"},{"v":-1.8225794252513952,"d":"-1.82"},{"v":-0.4619489662623632,"d":"-0.46"},{"v":0.39884628108934245,"d":"0.40"},{"v":0.3557394744630261,"d":"0.36"},{"v":0.9145149511547495,"d":"0.91"}]
[0.28332940764190584,{"v":0.6451043981707811,"d":"0.65"},{"v":-0.7258993456256296,"d":"-0.73"},{"v":-0.19822053335707102,"d":"-0.20"},{"v":-0.37982275854710734,"d":"-0.38"},{"v":0.7265975368219143,"d":"0.73"},{"v":-0.21304040241715408,"d":"-0.21"}]
[0.7311199172089237,{"v":-0.0791949711523188,"d":"-0.08"},{"v":-1.5882864515941872,"d":"-1.59"},{"v":1.0578630418037298,"d":"1.06"},{"v":0.22600099576311575,"d":"0.23"},{"v":-0.49568218100263656,"d":"-0.50"},{"v":0.664787422877705,"d":"0.66"}]
[1.3152559261703791,{"v":1.2816263523340508,"d":"1.28"},{"v":0.3124317604646931,"d":"0.31"},{"v":1.3153661960472465,"d":"1.32"},{"v":0.3766095130898276,"d":"0.38"},{"v":-1.0117098724505913,"d":"-1.01"},{"v":-1.80437690741446,"d":"-1.80"}]
[0.029008136446502186,{"v":0.08964437925908336,"d":"0.09"},{"v":-0.1965829624496603,"d":"-0.20"},{"v":0.22032726932008057,"d":"0.22"},{"v":-0.26185504041385993,"d":"-0.26"},{"v":0.08799298663273787,"d":"0.09"},{"v":-0.05012892705859033,"d":"-0.05"}]
[1.3273156966713788,{"v":0.28860596651600073,"d":"0.29"},{"v":0.5615280990880439,"d":"0.56"},{"v":0.7134976193659773,"d":"0.71"},{"v":0.9383028068540684,"d":"0.94"},{"v":0.2807970444953563,"d":"0.28"},{"v":-2.469200068780523,"d":"-2.47"}]
[5.559985345912676,{"v":-1.0349129455087545,"d":"-1.03"},{"v":2.75278304517642,"d":"2.75"},{"v":0.2192189985080128,"d":"0.22"},{"v":-4.548456434851554,"d":"-4.55"},{"v":1.957860706111584,"d":"1.96"},{"v":0.3759272845891502,"d":"0.38"}]
[1.0503247783700889,{"v":0.3679743736520399,"d":"0.37"},{"v":0.1995162177034397,"d":"0.20"},{"v":0.5500400431824253,"d":"0.55"},{"v":0.6485366914607615,"d":"0.65"},{"v":0.6934884356317629,"d":"0.69"},{"v":-2.218708342662291,"d":"-2.22"}]
[0.6691311564063477,{"v":0.44266847131598774,"d":"0.44"},{"v":0.3434092586486747,"d":"0.34"},{"v":0.539458932285489,"d":"0.54"},{"v":0.13846564689357824,"d":"0.14"},{"v":0.46904307677580376,"d":"0.47"},{"v":-1.7806491965436795,"d":"-1.78"}]
[5.185284136740546,{"v":-0.32895000941504465,"d":"-0.33"},{"v":-1.0131802476123308,"d":"-1.01"},{"v":-3.9579182489740745,"d":"-3.96"},{"v":0.10597717493122621,"d":"0.11"},{"v":3.1224510921725073,"d":"3.12"},{"v":2.1332870522786296,"d":"2.13"}]
[0.34835872778498955,{"v":0.2325766914270407,"d":"0.23"},{"v":-0.44116609462500855,"d":"-0.44"},{"v":-0.2810075361995438,"d":"-0.28"},{"v":-0.9888276994382066,"d":"-0.99"},{"v":0.5667133947835078,"d":"0.57"},{"v":0.6808255282110566,"d":"0.68"}]
[4.767462049277459,{"v":1.2655590948112307,"d":"1.27"},{"v":1.730706847036894,"d":"1.73"},{"v":2.041328662149032,"d":"2.04"},{"v":1.9822117395209502,"d":"1.98"},{"v":-2.21077205020134,"d":"-2.21"},{"v":-3.3202540772759663,"d":"-3.32"}]
[0.22550362005142324,{"v":-0.276265940510286,"d":"-0.28"},{"v":0.08515166712200137,"d":"0.09"},{"v":0.5352559686333193,"d":"0.54"},{"v":-0.08092670400110846,"d":"-0.08"},{"v":0.5223813940131032,"d":"0.52"},{"v":-0.8387595840404457,"d":"-0.84"}]
[{"$f":"SUMSQ(B67:G67)/6","v":3.0723105568506757},{"v":0.824943134367046,"d":"0.82"},{"v":0.9055511871179858,"d":"0.91"},{"v":0.8989529391082892,"d":"0.90"},{"v":1.1399884303477905,"d":"1.14"},{"v":0.7646784785161448,"d":"0.76"},{"v":-3.7737098497512918,"d":"-3.77"}]
[0.47410400714668866,{"v":0.6935132209836026,"d":"0.69"},{"v":-0.4884985064640573,"d":"-0.49"},{"v":0.24288073665280652,"d":"0.24"},{"v":1.0365942837211715,"d":"1.04"},{"v":-0.8193041866339466,"d":"-0.82"},{"v":-0.5659103752955363,"d":"-0.57"}]
[0.5385185883660322,{"v":0.6265647877133396,"d":"0.63"},{"v":0.22433690199442943,"d":"0.22"},{"v":-0.018347947736396152,"d":"-0.02"},{"v":0.35301121674877606,"d":"0.35"},{"v":0.4557760645116515,"d":"0.46"},{"v":-1.567008507979186,"d":"-1.57"}]
[0.20949263305683044,{"v":0.3516502254471251,"d":"0.35"},{"v":-0.5389790721739556,"d":"-0.54"},{"v":0.09229056542032138,"d":"0.09"},{"v":0.7050248570445647,"d":"0.71"},{"v":-0.5747629956391057,"d":"-0.57"},{"v":-0.08288171312250171,"d":"-0.08"}]
[0.3797793475132171,{"v":0.04451645951701636,"d":"0.04"},{"v":-1.090190222097316,"d":"-1.09"},{"v":-0.12780671549391592,"d":"-0.13"},{"v":-0.31016965245805334,"d":"-0.31"},{"v":0.3603090907013607,"d":"0.36"},{"v":0.9196832274655461,"d":"0.92"}]
[0.3583321443745436,{"v":0.4033464605592376,"d":"0.40"},{"v":-1.2634384128753477,"d":"-1.26"},{"v":0.2429946444058833,"d":"0.24"},{"v":0.08042160145675284,"d":"0.08"},{"v":0.5310487325157234,"d":"0.53"},{"v":-0.20856914530978046,"d":"-0.21"}]
[0.051733712086899815,{"v":-0.18466959492874552,"d":"-0.18"},{"v":-0.35943441140113486,"d":"-0.36"},{"v":0.23718636569473298,"d":"0.24"},{"v":-0.18542077177233732,"d":"-0.19"},{"v":0.11004823752069245,"d":"0.11"},{"v":0.21061212660584422,"d":"0.21"}]
[0.8204839262056339,{"v":0.5785043883463731,"d":"0.58"},{"v":0.8221488934569501,"d":"0.82"},{"v":1.1354044090521795,"d":"1.14"},{"v":0.17226003113558383,"d":"0.17"},{"v":-1.1367307197818992,"d":"-1.14"},{"v":-1.1407602759420883,"d":"-1.14"}]
[0.01860706926367021,{"v":0.16248496613652572,"d":"0.16"},{"v":0.06597513151441764,"d":"0.07"},{"v":-0.15232695555796294,"d":"-0.15"},{"v":-0.13278802807978954,"d":"-0.13"},{"v":-0.14987545803986524,"d":"-0.15"},{"v":0.13262548273145952,"d":"0.13"}]
[2.0531981946457667,{"v":1.0721399901813715,"d":"1.07"},{"v":0.9090914295417181,"d":"0.91"},{"v":1.2556414990027347,"d":"1.26"},{"v":1.0019184253278157,"d":"1.00"},{"v":-0.9241272472123591,"d":"-0.92"},{"v":-2.628454014814181,"d":"-2.63"}]
[0.710923234601065,{"v":0.7461966223650469,"d":"0.75"},{"v":1.0052813155727993,"d":"1.01"},{"v":0.4807117093196556,"d":"0.48"},{"v":-0.4770442395086912,"d":"-0.48"},{"v":-1.4962367023352916,"d":"-1.50"},{"v":-0.02757284165568871,"d":"-0.03"}]
[0.22965588463373207,{"v":0.39351226051231786,"d":"0.39"},{"v":-0.32023732061861304,"d":"-0.32"},{"v":0.26115079869249336,"d":"0.26"},{"v":0.47959962869533185,"d":"0.48"},{"v":-0.9035594083507142,"d":"-0.90"},{"v":0.07678749371069159,"d":"0.08"}]
[4.805329847607809,{"v":-3.692350255717194,"d":"-3.69"},{"v":3.690620656019304,"d":"3.69"},{"v":0.19345962911390602,"d":"0.19"},{"v":-0.952774000474676,"d":"-0.95"},{"v":-0.030058147855184823,"d":"-0.03"},{"v":0.7948203770574715,"d":"0.79"}]
[1.1752045988696278,{"v":-0.2339070074038327,"d":"-0.23"},{"v":-0.33626854767222225,"d":"-0.34"},{"v":-0.6482856269540953,"d":"-0.65"},{"v":-1.5712350715115628,"d":"-1.57"},{"v":0.7393091331060654,"d":"0.74"},{"v":1.8568270438019563,"d":"1.86"}]
[0.4902026271791679,{"v":0.7430160033318021,"d":"0.74"},{"v":0.6779220799822281,"d":"0.68"},{"v":0.5346247711160231,"d":"0.53"},{"v":0.008458649448837209,"d":"0.01"},{"v":-0.5625812909070643,"d":"-0.56"},{"v":-1.1520293971164082,"d":"-1.15"}]

{"sheet":"trust","index":11,"n_rows":81,"n_cols":26,"rows_kept":81}
[{"$f":"AVERAGE(var!B2:'var'!G81)","v":{"v":5.088522196198634e-18,"d":"0.00"}},{"$f":"ROUND(AVERAGE(trust!B2:B81),2)","v":77.23},{"$f":"ROUND(AVERAGE(trust!C2:C81),2)","v":80.31},{"$f":"ROUND(AVERAGE(trust!D2:D81),2)","v":74.75},{"$f":"ROUND(AVERAGE(trust!E2:E81),2)","v":75.81},{"$f":"ROUND(AVERAGE(trust!F2:F81),2)","v":63.18},{"$f":"ROUND(AVERAGE(trust!G2:G81),2)","v":64.43},{"$f":"ROUND(AVERAGE(trust!H2:H81),2)","v":{"$error":"#DIV/0!"}},{"$f":"ROUND(AVERAGE(trust!I2:I81),2)","v":{"$error":"#DIV/0!"}},{"$f":"ROUND(AVERAGE(trust!J2:J76),2)","v":{"$error":"#DIV/0!"}},{"$f":"ROUND(AVERAGE(trust!K2:K76),2)","v":{"$error":"#DIV/0!"}},{"$f":"ROUND(AVERAGE(trust!L2:L76),2)","v":{"$error":"#DIV/0!"}},{"$f":"ROUND(AVERAGE(trust!M2:M76),2)","v":{"$error":"#DIV/0!"}},{"$f":"ROUND(AVERAGE(trust!N2:N76),2)","v":{"$error":"#DIV/0!"}},{"$f":"ROUND(AVERAGE(trust!O2:O76),2)","v":{"$error":"#DIV/0!"}},{"$f":"ROUND(AVERAGE(trust!P2:P76),2)","v":{"$error":"#DIV/0!"}},{"$f":"ROUND(AVERAGE(trust!Q2:Q76),2)","v":{"$error":"#DIV/0!"}},{"$f":"ROUND(AVERAGE(trust!R2:R76),2)","v":{"$error":"#DIV/0!"}},{"$f":"ROUND(AVERAGE(trust!S2:S76),2)","v":{"$error":"#DIV/0!"}},{"$f":"ROUND(AVERAGE(trust!T2:T76),2)","v":{"$error":"#DIV/0!"}},{"$f":"ROUND(AVERAGE(trust!U2:U76),2)","v":{"$error":"#DIV/0!"}},{"$f":"ROUND(AVERAGE(trust!V2:V76),2)","v":{"$error":"#DIV/0!"}},{"$f":"ROUND(AVERAGE(trust!W2:W76),2)","v":{"$error":"#DIV/0!"}},{"$f":"ROUND(AVERAGE(trust!X2:X76),2)","v":{"$error":"#DIV/0!"}},{"$f":"ROUND(AVERAGE(trust!Y2:Y76),2)","v":{"$error":"#DIV/0!"}},{"$f":"ROUND(AVERAGE(trust!Z2:Z76),2)","v":{"$error":"#DIV/0!"}}]
[{"$f":"ROUND(AVERAGE(trust!B2:G2),2)","v":74.9},72.18406593406593,87.59615384615384,71.15384615384616,74.75961538461539,73.39743589743588,70.32967032967034]
[{"$f":"ROUND(AVERAGE(trust!B3:G3),2)","v":79.15},81.02678571428571,88.75,80.46875,79.296875,73.95833333333333,71.42857142857143]
[{"$f":"ROUND(AVERAGE(trust!B4:G4),2)","v":68.11},70.53571428571429,81.25,65.3125,60.625,60.41666666666667,70.53571428571429]
[{"$f":"ROUND(AVERAGE(trust!B5:G5),2)","v":61.41},58.29081632653062,80.17857142857144,43.75,63.83928571428572,56.845238095238095,65.56122448979592]
[{"$f":"ROUND(AVERAGE(trust!B6:G6),2)","v":66.5},65,81.75000000000001,56.875,61.875,63.33333333333333,70.17857142857143]
[{"$f":"ROUND(AVERAGE(trust!B7:G7),2)","v":65.46},64.79591836734693,73.13186813186813,62.39697802197802,61.83035714285715,63.91941391941391,66.67974882260596]
[{"$f":"ROUND(AVERAGE(trust!B8:G8),2)","v":75},71.45408163265307,88.75,69.86607142857142,76.29464285714286,69.82142857142857,73.82653061224491]
[{"$f":"ROUND(AVERAGE(trust!B9:G9),2)","v":66.58},61.54336734693877,78.83928571428571,63.002232142857146,64.00669642857143,61.75595238095237,70.34438775510205]
[{"$f":"ROUND(AVERAGE(trust!B10:G10),2)","v":69.72},65.41149068322981,84.02173913043478,58.22010869565217,62.7038043478261,75.09057971014494,72.86490683229815]
[{"$f":"ROUND(AVERAGE(trust!B11:G11),2)","v":76.57},84.64285714285714,84,80.625,76.25,65.13888888888889,68.75]
[{"$f":"ROUND(AVERAGE(trust!B12:G12),2)","v":62.7},70.53571428571429,81.25,62.5,62.5,39.583333333333336,59.82142857142857]
[{"$f":"ROUND(AVERAGE(trust!B13:G13),2)","v":70.67},69.4327731092437,84.55882352941178,67.1875,69.39338235294117,64.4607843137255,68.96008403361344]
[{"$f":"ROUND(AVERAGE(trust!B14:G14),2)","v":69.86},62.5,87.578125,62.20703125,65.4296875,67.70833333333333,73.71651785714286]
[{"$f":"ROUND(AVERAGE(trust!B15:G15),2)","v":73.07},78.71565934065933,78.42307692307692,76.27403846153845,78.14903846153845,62.9326923076923,63.901098901098905]
[{"$f":"ROUND(AVERAGE(trust!B16:G16),2)","v":72.43},81.76291793313068,77.34042553191489,79.25531914893618,80.45212765957447,58.15602836879433,57.598784194528875]
[{"$f":"ROUND(AVERAGE(trust!B17:G17),2)","v":69.08},76.4751552795031,73.91304347826087,75.95108695652173,78.39673913043478,51.53985507246377,58.19099378881988]
[{"$f":"ROUND(AVERAGE(trust!B18:G18),2)","v":75.59},87.71008403361344,85.66176470588235,82.62867647058822,80.97426470588235,55.02450980392157,61.5546218487395]
[{"$f":"ROUND(AVERAGE(trust!B19:G19),2)","v":79.39},87.11734693877551,88.30357142857142,87.61160714285714,87.16517857142858,64.23611111111111,61.926020408163275]
[{"$f":"ROUND(AVERAGE(trust!B20:G20),2)","v":70.42},80.08760107816713,73.3254716981132,76.29716981132074,75.85495283018868,58.018867924528294,58.96226415094338]
[{"$f":"ROUND(AVERAGE(trust!B21:G21),2)","v":70.69},82.87815126050421,75.0735294117647,77.48161764705881,78.40073529411765,54.534313725490186,55.77731092436975]
[{"$f":"ROUND(AVERAGE(trust!B22:G22),2)","v":78.48},87.82467532467533,86.875,86.29261363636364,88.28125,59.75378787878786,61.85064935064935]
[{"$f":"ROUND(AVERAGE(trust!B23:G23),2)","v":75.17},81.57967032967034,83.21153846153844,81.17788461538461,81.97115384615384,61.217948717948715,61.88186813186813]
[{"$f":"ROUND(AVERAGE(trust!B24:G24),2)","v":76.1},83.15637065637064,81.48648648648648,80.57432432432434,82.17905405405405,62.01201201201201,67.18146718146718]
[{"$f":"ROUND(AVERAGE(trust!B25:G25),2)","v":74.55},83.2820197044335,82.99568965517241,81.49245689655172,82.38146551724137,59.08764367816091,58.06650246305418]
[{"$f":"ROUND(AVERAGE(trust!B26:G26),2)","v":72.85},79.06141114982579,76.95121951219512,78.96341463414635,80.39253048780488,57.92682926829268,63.80662020905923]
[{"$f":"ROUND(AVERAGE(trust!B27:G27),2)","v":65.37},59.26995798319327,71.21323529411765,63.465073529411754,63.32720588235294,61.0906862745098,73.84453781512605]
[{"$f":"ROUND(AVERAGE(trust!B28:G28),2)","v":70.91},80.46875,75.9375,77.9296875,73.2421875,53.73263888888889,64.17410714285714]
[{"$f":"ROUND(AVERAGE(trust!B29:G29),2)","v":74.56},81.29658385093168,79.52173913043478,81.08695652173914,82.30978260869566,57.807971014492765,65.34161490683229]
[{"$f":"ROUND(AVERAGE(trust!B30:G30),2)","v":77.47},85.26785714285714,80.78125,86.9140625,89.2578125,59.63541666666667,62.94642857142857]
[{"$f":"ROUND(AVERAGE(trust!B31:G31),2)","v":74.06},82.58928571428571,74.94318181818183,79.9715909090909,81.67613636363636,60.984848484848484,64.20454545454547]
[{"$f":"ROUND(AVERAGE(trust!B32:G32),2)","v":68.81},73.64285714285714,73.6,72.4375,74.5,55.83333333333333,62.82142857142858]
[{"$f":"ROUND(AVERAGE(trust!B33:G33),2)","v":80.45},85.3896103896104,89.77272727272727,87.64204545454545,87.64204545454545,67.04545454545453,65.17857142857143]
[{"$f":"ROUND(AVERAGE(trust!B34:G34),2)","v":80.19},83.50243506493507,88.23863636363636,85.72443181818181,87.109375,67.99242424242426,68.58766233766235]
[{"$f":"ROUND(AVERAGE(trust!B35:G35),2)","v":74.76},82.43038740920096,81.5677966101695,82.20338983050848,82.28283898305085,57.09745762711865,62.99939467312349]
[{"$f":"ROUND(AVERAGE(trust!B36:G36),2)","v":77.89},85.50420168067228,87.64705882352942,82.90441176470588,84.28308823529412,60.41666666666667,66.5966386554622]
[{"$f":"ROUND(AVERAGE(trust!B37:G37),2)","v":72.82},79.24107142857143,78.4375,78.90625,75.9765625,62.5,61.830357142857146]
[{"$f":"ROUND(AVERAGE(trust!B38:G38),2)","v":62.95},59.28571428571429,81.99999999999999,48.4375,54.0625,65,68.92857142857143]
[{"$f":"ROUND(AVERAGE(trust!B39:G39),2)","v":59.32},44.642857142857146,63.75,43.75,68.75,61.80555555555556,73.21428571428571]
[{"$f":"ROUND(AVERAGE(trust!B40:G40),2)","v":63.4},60.825892857142854,75.15625,54.296875,60.7421875,63.54166666666667,65.84821428571429]
[{"$f":"ROUND(AVERAGE(trust!B41:G41),2)","v":74.56},81.07718894009217,80.28225806451613,77.77217741935485,78.52822580645162,65.65860215053763,64.0552995391705]
[{"$f":"ROUND(AVERAGE(trust!B42:G42),2)","v":76.77},81.33640552995391,81.06854838709675,81.32560483870968,80.64516129032259,69.8252688172043,66.43145161290322]
[{"$f":"ROUND(AVERAGE(trust!B43:G43),2)","v":66.72},72.97794117647058,69.66911764705881,68.77297794117646,69.39338235294119,59.12990196078432,60.37289915966386]
[{"$f":"ROUND(AVERAGE(trust!B44:G44),2)","v":68.6},74.85294117647058,74.27941176470588,71.21323529411765,70.27573529411765,61.6421568627451,59.317226890756295]
[{"$f":"ROUND(AVERAGE(trust!B45:G45),2)","v":68.82},78.57142857142857,78.25,69.0625,73.28125,56.875,56.875]
[{"$f":"ROUND(AVERAGE(trust!B46:G46),2)","v":78.61},87.94642857142858,78.25,82.65625,84.0625,66.04166666666667,72.67857142857143]
[{"$f":"ROUND(AVERAGE(trust!B47:G47),2)","v":69.58},73.21428571428571,75.1923076923077,67.54807692307692,68.99038461538461,64.26282051282051,68.26923076923076]
[{"$f":"ROUND(AVERAGE(trust!B48:G48),2)","v":74.73},76.65816326530613,75.35714285714286,79.91071428571429,77.23214285714288,70.23809523809524,69.00510204081633]
[{"$f":"ROUND(AVERAGE(trust!B49:G49),2)","v":74.07},81.78571428571429,73.5625,80.3125,78.671875,63.02083333333333,67.05357142857143]
[{"$f":"ROUND(AVERAGE(trust!B50:G50),2)","v":72.53},78.3110119047619,77.5,74.8046875,76.953125,64.67013888888889,62.94642857142857]
[{"$f":"ROUND(AVERAGE(trust!B51:G51),2)","v":76.21},86.60714285714286,73.75,85.9375,85.9375,62.5,62.5]
[{"$f":"ROUND(AVERAGE(trust!B52:G52),2)","v":65.73},67.1875,68.125,71.875,72.4609375,58.59375,56.138392857142854]
[{"$f":"ROUND(AVERAGE(trust!B53:G53),2)","v":75.86},87.5,83.75,78.125,84.375,62.5,58.92857142857143]
[{"$f":"ROUND(AVERAGE(trust!B54:G54),2)","v":70.34},77.23214285714286,67.1875,69.53125,76.5625,63.02083333333333,68.52678571428571]
[{"$f":"ROUND(AVERAGE(trust!B55:G55),2)","v":63.04},73.21428571428571,67.5,64.0625,64.0625,57.63888888888889,51.78571428571429]
[{"$f":"ROUND(AVERAGE(trust!B56:G56),2)","v":67.84},72.54464285714286,66.25,77.734375,73.046875,53.64583333333333,63.83928571428571]
[{"$f":"ROUND(AVERAGE(trust!B57:G57),2)","v":81.07},91.96428571428571,88.75,90.625,85.9375,66.66666666666667,62.5]
[{"$f":"ROUND(AVERAGE(trust!B58:G58),2)","v":73.54},78.83928571428571,80.12499999999999,77.265625,75.15625,64.79166666666667,65.04464285714286]
[{"$f":"ROUND(AVERAGE(trust!B59:G59),2)","v":79.18},84.9025974025974,88.75,85.51136363636364,87.64204545454545,73.1060606060606,55.19480519480519]
[{"$f":"ROUND(AVERAGE(trust!B60:G60),2)","v":77.8},75.89285714285714,100,81.25,53.125,83.33333333333334,73.21428571428571]
[{"$f":"ROUND(AVERAGE(trust!B61:G61),2)","v":85.8},90.625,91.47727272727273,90.19886363636364,91.26420454545455,84.0909090909091,67.12662337662339]
[{"$f":"ROUND(AVERAGE(trust!B62:G62),2)","v":79.09},85.71428571428571,87.5,84.375,82.8125,74.30555555555556,59.82142857142857]
[{"$f":"ROUND(AVERAGE(trust!B63:G63),2)","v":48.56},51.78571428571429,51.25,20.3125,53.125,60.41666666666667,54.46428571428571]
[{"$f":"ROUND(AVERAGE(trust!B64:G64),2)","v":68.76},75.51020408163266,74.55357142857143,69.19642857142858,65.51339285714285,62.79761904761904,64.98724489795919]
[{"$f":"ROUND(AVERAGE(trust!B65:G65),2)","v":89.68},97.32142857142858,100,100,100,72.91666666666667,67.85714285714286]
[{"$f":"ROUND(AVERAGE(trust!B66:G66),2)","v":79.83},82.21428571428571,86.64999999999999,85,82.1875,75.58333333333334,67.32142857142857]
[{"$f":"ROUND(AVERAGE(trust!B67:G67),2)","v":91.14},96.39778325123152,97.54310344827584,95.95905172413792,97.2521551724138,91.09195402298847,68.5960591133005]
[{"$f":"ROUND(AVERAGE(trust!B68:G68),2)","v":76.7},85.26785714285714,81.015625,80.37109375,86.23046875,62.109375,65.17857142857143]
[{"$f":"ROUND(AVERAGE(trust!B69:G69),2)","v":72.93},81.75223214285714,82.1875,75.09765625,78.61328125,66.796875,53.125]
[{"$f":"ROUND(AVERAGE(trust!B70:G70),2)","v":69.92},77.35389610389609,74.94318181818181,72.9403409090909,78.26704545454545,55.49242424242425,60.551948051948045]
[{"$f":"ROUND(AVERAGE(trust!B71:G71),2)","v":61.75},67.67857142857143,63.75,63.28125,63.28125,53.40277777777777,59.107142857142854]
[{"$f":"ROUND(AVERAGE(trust!B72:G72),2)","v":71.58},79.14540816326532,71.875,75.55803571428572,75.55803571428571,65.77380952380953,61.54336734693877]
[{"$f":"ROUND(AVERAGE(trust!B73:G73),2)","v":75.39},78.77435064935065,80.68181818181819,79.11931818181819,77.41477272727272,67.20328282828282,69.15584415584415]
[{"$f":"ROUND(AVERAGE(trust!B74:G74),2)","v":82.4},89.09438775510205,92.23214285714286,90.625,85.9375,67.70833333333333,68.81377551020407]
[{"$f":"ROUND(AVERAGE(trust!B75:G75),2)","v":74.38},80.04464285714286,82.37500000000001,75.625,76.796875,64.0625,67.38839285714286]
[{"$f":"ROUND(AVERAGE(trust!B76:G76),2)","v":82.33},91.69642857142858,92.62499999999999,91.25,90.46875,69.02777777777777,58.92857142857143]
[{"$f":"ROUND(AVERAGE(trust!B77:G77),2)","v":75.54},84.6590909090909,88.75,80.82386363636364,75.71022727272727,55.68181818181817,67.61363636363636]
[{"$f":"ROUND(AVERAGE(trust!B78:G78),2)","v":70.31},77.97619047619047,76.66666666666666,74.47916666666666,77.08333333333333,53.47222222222223,62.20238095238096]
[{"$f":"ROUND(AVERAGE(trust!B79:G79),2)","v":63.3},42.41071428571429,98.125,67.1875,60.15625,52.08333333333333,59.82142857142857]
[{"$f":"ROUND(AVERAGE(trust!B80:G80),2)","v":59.42},63.392857142857146,66.875,57.03125,51.5625,53.81944444444444,63.83928571428571]
[{"$f":"ROUND(AVERAGE(trust!B81:G81),2)","v":77.58},86.27232142857142,88.28125,83.0078125,80.6640625,65.10416666666667,62.16517857142857]

{"sheet":"fre","index":12,"n_rows":601,"n_cols":19,"rows_kept":601}
[{"$f":"AVERAGE(C2:C11105)","v":2.6607142857142856},{"$f":"STDEV(C2:C11104)","v":0.9730936218633833},{"$nulls":3},"難度","loading","鑑別度","PTMEAS",{"$nulls":4},100,100,{"$f":"COUNTA(P2:P4000)+2","v":602},"通過率",{"$f":"AVERAGE(P2:P2000)","v":0.14491071428571436},{"$f":"AVERAGE(Q2:Q2000)","v":0.6465277777777775}]
["Teamwork Climate",null,2,{"$f":"0.737-1/24","v":0.6953333333333334},null,0.01,0.6259,0.4722398142284146,0.6259,null,"各章成績之分佈與受評醫院落點",{"$nulls":4},0.125,0.75,0.7]
["Safety Climate",null,1,null,null,0.17,0.6715,0.521531100478469,0.6715,{"$nulls":6},0.125,0.5833333333333333,0.7]
["Job Satisfaction",null,2,null,null,0.53,0.6262,0.5229690406907408,0.6262,{"$nulls":6},0.1160714285714286,0.75,0.7]
["Stress Recognition",null,3,null,null,-0.01,0.6721,0.5062947420390027,0.6721,{"$nulls":6},0.1071428571428571,0.41666666666666663,0.7]
["Perception of Management",null,2,null,null,-0.37,0.6895,0.452894189736295,0.6895,{"$nulls":6},0.125,0.5,0.7]
["Working Condition",null,3,null,null,-0.1,0.7296,0.5446265938069217,0.7296,{"$nulls":6},0.1517857142857143,0.5,0.7]
[null,null,1,null,null,-0.44,0.69,0.47304631922853985,0.69,{"$nulls":6},0.1964285714285714,0.75,0.7]
[null,null,1,null,null,0.21,0.6193,0.5033030348184573,0.6193,{"$nulls":6},0.1607142857142857,0.8333333333333334,0.7]
[null,null,3,{"$nulls":12},0.1875,0.8333333333333334,0.7]
[null,null,2,{"$nulls":12},0.1785714285714286,0.6666666666666667,0.7]
[null,null,2,{"$nulls":12},0.1696428571428571,0.8333333333333334,0.7]
[null,null,1,{"$nulls":12},0.125,0.41666666666666663,0.7]
[null,null,2,{"$nulls":12},0.1428571428571429,0.8333333333333334,0.7]
[null,null,2,{"$nulls":12},0.1696428571428571,0.8333333333333334,0.7]
[null,null,2,{"$nulls":12},0.1696428571428571,0.8333333333333334,0.7]
[null,null,2,{"$nulls":12},0.1339285714285714,0.5,0.7]
[null,null,3,{"$nulls":12},0.1339285714285714,0.75,0.7]
[null,null,3,{"$nulls":12},0.1160714285714286,0.41666666666666663,0.7]
[null,null,4,{"$nulls":12},0.1607142857142857,0.8333333333333334,0.7]
[null,null,2,"skew_median",-3.492157459259033,{"$nulls":10},0.1428571428571429,0.75,0.7]
[null,null,4,"2.5% delta",-3.858023166656494,{"$nulls":10},0.1696428571428571,0.8333333333333334,0.7]
[null,null,3,"97.5% delta",-3.182748556137085,{"$nulls":10},0.1160714285714286,0.75,0.7]
[null,null,4,"Kurtosis",18.313886642456055,{"$nulls":10},0.1607142857142857,0.8333333333333334,0.7]
[null,null,2,"2.5% delta",15.884038925170898,{"$nulls":10},0.1696428571428571,0.75,0.7]
[null,null,3,"97.5% delta",20.965974807739258,{"$nulls":10},0.1696428571428571,0.75,0.7]
[null,null,2,{"$nulls":12},0.1428571428571429,0.75,0.7]
[null,null,4,{"$nulls":12},0.0892857142857143,0.41666666666666663,0.7]
[null,null,4,{"$nulls":12},0.0803571428571429,0.41666666666666663,0.7]
[null,null,4,{"$nulls":12},0.125,0.5,0.7]
[null,null,2,{"$nulls":12},0.1339285714285714,0.5833333333333333,0.7]
[null,null,2,{"$nulls":12},0.125,0.5,0.7]
[null,null,1,{"$nulls":12},0.1517857142857143,0.41666666666666663,0.7]
[null,null,2,{"$nulls":12},0.0982142857142857,0.41666666666666663,0.7]
[null,null,4,{"$nulls":12},0.2053571428571429,0.8333333333333334,0.7]
[null,null,4,{"$nulls":12},0.1607142857142857,0.75,0.7]
[null,null,2,{"$nulls":12},0.1517857142857143,0.5,0.7]
[null,null,3,{"$nulls":12},0.1071428571428571,0.41666666666666663,0.7]
[null,null,3,{"$nulls":12},0.0803571428571429,0.5,0.7]
[null,null,3,{"$nulls":12},0.125,0.5,0.7]
[null,null,2,{"$nulls":12},0.1964285714285714,0.75,0.7]
[null,null,2,{"$nulls":12},0.1160714285714286,0.5,0.7]
[null,null,2,{"$nulls":12},0.1160714285714286,0.75,0.7]
[null,null,2,{"$nulls":12},0.1607142857142857,0.8333333333333334,0.7]
[null,null,3,{"$nulls":12},0.1607142857142857,0.75,0.7]
[null,null,3,{"$nulls":12},0.1071428571428571,0.41666666666666663,0.7]
[null,null,1,{"$nulls":12},0.1696428571428571,0.8333333333333334,0.7]
[null,null,4,{"$nulls":12},0.1875,0.75,0.7]
[null,null,4,{"$nulls":12},0.1517857142857143,0.8333333333333334,0.7]
[null,null,3,{"$nulls":12},0.1339285714285714,0.75,0.7]
[null,null,3,{"$nulls":12},0.1875,0.8333333333333334,0.7]
[null,null,0,{"$nulls":12},0.1160714285714286,0.41666666666666663,0.7]
[null,null,3,{"$nulls":12},0.0982142857142857,0.5,0.7]
[null,null,2,{"$nulls":12},0.1428571428571429,0.75,0.7]
[null,null,2,{"$nulls":12},0.1785714285714286,0.8333333333333334,0.7]
[null,null,4,{"$nulls":12},0.125,0.75,0.7]
[null,null,4,{"$nulls":12},0.0892857142857143,0.33333333333333337,0.7]
[null,null,4,{"$nulls":12},0.1607142857142857,0.8333333333333334,0.7]
[null,null,3,{"$nulls":12},0.125,0.75,0.7]
[null,null,2,{"$nulls":12},0.1607142857142857,0.75,0.7]
[null,null,2,{"$nulls":12},0.1428571428571429,0.75,0.7]
[null,null,2,{"$nulls":12},0.1517857142857143,0.8333333333333334,0.7]
[null,null,4,{"$nulls":12},0.125,0.41666666666666663,0.7]
[null,null,1,{"$nulls":12},0.1339285714285714,0.75,0.7]
[null,null,2,{"$nulls":12},0.1428571428571429,0.41666666666666663,0.7]
[null,null,4,{"$nulls":12},0.1071428571428571,0.5,0.7]
[null,null,3,{"$nulls":12},0.1607142857142857,0.75,0.7]
[null,null,4,{"$nulls":12},0.1785714285714286,0.8333333333333334,0.7]
[null,null,1,{"$nulls":12},0.1071428571428571,0.41666666666666663,0.7]
[null,null,4,{"$nulls":12},0.1517857142857143,0.8333333333333334,0.7]
[null,null,3,{"$nulls":12},0.1607142857142857,0.8333333333333334,0.7]
[null,null,3,{"$nulls":12},0.1160714285714286,0.5,0.7]
[null,null,2,{"$nulls":12},0.1428571428571429,0.8333333333333334,0.7]
[null,null,4,{"$nulls":12},0.125,0.41666666666666663,0.7]
[null,null,1,{"$nulls":12},0.1339285714285714,0.5,0.7]
[null,null,3,{"$nulls":12},0.1339285714285714,0.6666666666666667,0.7]
[null,null,3,{"$nulls":12},0.1696428571428571,0.8333333333333334,0.7]
[null,null,3,{"$nulls":12},0.1696428571428571,0.75,0.7]
[null,null,2,{"$nulls":12},0.1339285714285714,0.8333333333333334,0.7]
[null,null,2,{"$nulls":12},0.1696428571428571,0.8333333333333334,0.7]
[null,null,2,{"$nulls":12},0.1339285714285714,0.75,0.7]
[null,null,4,{"$nulls":12},0.125,0.8333333333333334,0.7]
[null,null,4,{"$nulls":12},0.1428571428571429,0.75,0.7]
[null,null,4,{"$nulls":12},0.1696428571428571,0.5,0.7]
[null,null,2,{"$nulls":12},0.1428571428571429,0.8333333333333334,0.7]
[null,null,3,{"$nulls":12},0.1607142857142857,0.8333333333333334,0.7]
[null,null,3,{"$nulls":12},0.1785714285714286,0.8333333333333334,0.7]
[null,null,3,{"$nulls":12},0.1071428571428571,0.5,0.7]
[null,null,2,{"$nulls":12},0.1517857142857143,0.8333333333333334,0.7]
[null,null,0,{"$nulls":12},0.1607142857142857,0.8333333333333334,0.7]
[null,null,4,{"$nulls":12},0.125,0.5,0.7]
[null,null,2,{"$nulls":12},0.1517857142857143,0.8333333333333334,0.7]
[null,null,3,{"$nulls":12},0.1428571428571429,0.75,0.7]
[null,null,4,{"$nulls":12},0.1696428571428571,0.75,0.7]
[null,null,2,{"$nulls":12},0.1785714285714286,0.6666666666666667,0.7]
[null,null,4,{"$nulls":12},0.1517857142857143,0.75,0.7]
[null,null,2,{"$nulls":12},0.1517857142857143,0.41666666666666663,0.7]
[null,null,3,{"$nulls":12},0.1517857142857143,0.75,0.7]
[null,null,3,{"$nulls":12},0.0982142857142857,0.41666666666666663,0.7]
[null,null,3,{"$nulls":12},0.0982142857142857,0.41666666666666663,0.7]
[null,null,2,{"$nulls":12},0.1696428571428571,0.8333333333333334,0.7]
[null,null,3,{"$nulls":12},0.1696428571428571,0.8333333333333334,0.7]
[null,null,3,{"$nulls":12},0.1517857142857143,0.8333333333333334,0.7]
[null,null,3,{"$nulls":12},0.1696428571428571,0.75,0.7]
[null,null,3,{"$nulls":12},0.1696428571428571,0.8333333333333334,0.7]
[null,null,3,{"$nulls":12},0.1607142857142857,0.8333333333333334,0.7]
[null,null,3,{"$nulls":12},0.1517857142857143,0.8333333333333334,0.7]
[null,null,3,{"$nulls":12},0.125,0.5,0.7]
[null,null,1,{"$nulls":12},0.1071428571428571,0.41666666666666663,0.7]
[null,null,3,{"$nulls":12},0.1428571428571429,0.41666666666666663,0.7]
[null,null,3,{"$nulls":12},0.1785714285714286,0.8333333333333334,0.7]
[null,null,3,{"$nulls":12},0.1160714285714286,0.5,0.7]
[null,null,3,{"$nulls":12},0.1160714285714286,0.8333333333333334,0.7]
[{"$nulls":15},0.1875,0.8333333333333334,0.7]
[{"$nulls":15},0.1339285714285714,0.5,0.7]
[{"$nulls":15},0.125,0.8333333333333334,0.7]
[{"$nulls":15},0.1607142857142857,0.75,0.7]
[{"$nulls":15},0.1875,0.8333333333333334,0.7]
[{"$nulls":15},0.1607142857142857,0.75,0.7]
[{"$nulls":15},0.1785714285714286,0.8333333333333334,0.7]
[{"$nulls":15},0.0892857142857143,0.5,0.7]
[{"$nulls":15},0.1696428571428571,0.75,0.7]
[{"$nulls":15},0.1428571428571429,0.8333333333333334,0.7]
[{"$nulls":15},0.1785714285714286,0.75,0.7]
[{"$nulls":15},0.0982142857142857,0.41666666666666663,0.7]
[{"$nulls":15},0.1875,0.8333333333333334,0.7]
[{"$nulls":15},0.125,0.41666666666666663,0.7]
[{"$nulls":15},0.1517857142857143,0.8333333333333334,0.7]
[{"$nulls":15},0.0892857142857143,0.5833333333333333,0.7]
[{"$nulls":15},0.0803571428571429,0.5,0.7]
[{"$nulls":15},0.125,0.5,0.7]
[{"$nulls":15},0.1607142857142857,0.75,0.7]
[{"$nulls":15},0.1339285714285714,0.5,0.7]
[{"$nulls":15},0.1785714285714286,0.8333333333333334,0.7]
[{"$nulls":15},0.1071428571428571,0.5,0.7]
[{"$nulls":15},0.1428571428571429,0.75,0.7]
[{"$nulls":15},0.1339285714285714,0.41666666666666663,0.7]
[{"$nulls":15},0.1607142857142857,0.8333333333333334,0.7]
[{"$nulls":15},0.1607142857142857,0.5,0.7]
[{"$nulls":15},0.1517857142857143,0.8333333333333334,0.7]
[{"$nulls":15},0.1071428571428571,0.5,0.7]
[{"$nulls":15},0.1071428571428571,0.41666666666666663,0.7]
[{"$nulls":15},0.1071428571428571,0.5,0.7]
[{"$nulls":15},0.0803571428571429,0.33333333333333337,0.7]
[{"$nulls":15},0.1160714285714286,0.5,0.7]
[{"$nulls":15},0.1428571428571429,0.5,0.7]
[{"$nulls":15},0.1785714285714286,0.8333333333333334,0.7]
[{"$nulls":15},0.0982142857142857,0.5,0.7]
[{"$nulls":15},0.1339285714285714,0.5,0.7]
[{"$nulls":15},0.1696428571428571,0.8333333333333334,0.7]
[{"$nulls":15},0.1875,0.8333333333333334,0.7]
[{"$nulls":15},0.1339285714285714,0.75,0.7]
[{"$nulls":15},0.1071428571428571,0.5,0.7]
[{"$nulls":15},0.1607142857142857,0.75,0.7]
[{"$nulls":15},0.0892857142857143,0.41666666666666663,0.7]
[{"$nulls":15},0.1607142857142857,0.8333333333333334,0.7]
[{"$nulls":15},0.1160714285714286,0.5,0.7]
[{"$nulls":15},0.1517857142857143,0.8333333333333334,0.7]
[{"$nulls":15},0.1428571428571429,0.5,0.7]
[{"$nulls":15},0.1517857142857143,0.8333333333333334,0.7]
[{"$nulls":15},0.1160714285714286,0.41666666666666663,0.7]
[{"$nulls":15},0.1875,0.8333333333333334,0.7]
[{"$nulls":15},0.1071428571428571,0.33333333333333337,0.7]
[{"$nulls":15},0.1607142857142857,0.8333333333333334,0.7]
[{"$nulls":15},0.1964285714285714,0.8333333333333334,0.7]
[{"$nulls":15},0.1517857142857143,0.75,0.7]
[{"$nulls":15},0.1696428571428571,0.8333333333333334,0.7]
[{"$nulls":15},0.1607142857142857,0.8333333333333334,0.7]
[{"$nulls":15},0.1160714285714286,0.6666666666666667,0.7]
[{"$nulls":15},0.1696428571428571,0.75,0.7]
[{"$nulls":15},0.0892857142857143,0.41666666666666663,0.7]
[{"$nulls":15},0.1160714285714286,0.41666666666666663,0.7]
[{"$nulls":15},0.1607142857142857,0.5,0.7]
[{"$nulls":15},0.1875,0.8333333333333334,0.7]
[{"$nulls":15},0.1785714285714286,0.8333333333333334,0.7]
[{"$nulls":15},0.1964285714285714,0.8333333333333334,0.7]
[{"$nulls":15},0.1339285714285714,0.5833333333333333,0.7]
[{"$nulls":15},0.1696428571428571,0.8333333333333334,0.7]
[{"$nulls":15},0.1428571428571429,0.5,0.7]
[{"$nulls":15},0.0982142857142857,0.5,0.7]
[{"$nulls":15},0.1160714285714286,0.5,0.7]
[{"$nulls":15},0.1517857142857143,0.8333333333333334,0.7]
[{"$nulls":15},0.1517857142857143,0.8333333333333334,0.7]
[{"$nulls":15},0.1160714285714286,0.41666666666666663,0.7]
[{"$nulls":15},0.1696428571428571,0.8333333333333334,0.7]
[{"$nulls":15},0.1517857142857143,0.5,0.7]
[{"$nulls":15},0.125,0.41666666666666663,0.7]
[{"$nulls":15},0.1339285714285714,0.75,0.7]
[{"$nulls":15},0.1517857142857143,0.8333333333333334,0.7]
[{"$nulls":15},0.1696428571428571,0.8333333333333334,0.7]
[{"$nulls":15},0.0892857142857143,0.41666666666666663,0.7]
[{"$nulls":15},0.1339285714285714,0.8333333333333334,0.7]
[{"$nulls":15},0.1339285714285714,0.75,0.7]
[{"$nulls":15},0.1428571428571429,0.5,0.7]
[{"$nulls":15},0.0982142857142857,0.5,0.7]
[{"$nulls":15},0.1607142857142857,0.75,0.7]
[{"$nulls":15},0.1428571428571429,0.8333333333333334,0.7]
[{"$nulls":15},0.1875,0.8333333333333334,0.7]
[{"$nulls":15},0.1517857142857143,0.8333333333333334,0.7]
[{"$nulls":15},0.1071428571428571,0.5,0.7]
[{"$nulls":15},0.125,0.5833333333333333,0.7]
[{"$nulls":15},0.0714285714285714,0.41666666666666663,0.8]
[{"$nulls":15},0.0892857142857143,0.41666666666666663,0.8]
[{"$nulls":15},0.0714285714285714,0.41666666666666663,0.8]
[{"$nulls":15},0.1160714285714286,0.41666666666666663,0.8]
[{"$nulls":15},0.0267857142857143,0.25,0.8]
[{"$nulls":15},0.0892857142857143,0.41666666666666663,0.8]
[{"$nulls":15},0.0892857142857143,0.41666666666666663,0.8]
[{"$nulls":15},0.0714285714285714,0.41666666666666663,0.8]
[{"$nulls":15},0.0714285714285714,0.41666666666666663,0.8]
[{"$nulls":15},0.0625,0.41666666666666663,0.8]
[{"$nulls":15},0.0625,0.41666666666666663,0.8]
[{"$nulls":15},0.044642857142857095,0.41666666666666663,0.8]
[{"$nulls":15},0.0535714285714286,0.41666666666666663,0.8]
[{"$nulls":15},0.0892857142857143,0.41666666666666663,0.8]
[{"$nulls":15},0.0982142857142857,0.41666666666666663,0.8]
[{"$nulls":15},0.0892857142857143,0.41666666666666663,0.8]
[{"$nulls":15},0.0892857142857143,0.41666666666666663,0.8]
[{"$nulls":15},0.0625,0.41666666666666663,0.8]
[{"$nulls":15},0.0714285714285714,0.41666666666666663,0.8]
[{"$nulls":15},0.0714285714285714,0.41666666666666663,0.8]
[{"$nulls":15},0.0892857142857143,0.41666666666666663,0.8]
[{"$nulls":15},0.0714285714285714,0.41666666666666663,0.8]
[{"$nulls":15},0.0982142857142857,0.41666666666666663,0.8]
[{"$nulls":15},0.0535714285714286,0.25,0.8]
[{"$nulls":15},0.0714285714285714,0.33333333333333337,0.8]
[{"$nulls":15},0.0982142857142857,0.41666666666666663,0.8]
[{"$nulls":15},0.0982142857142857,0.33333333333333337,0.8]
[{"$nulls":15},0.0714285714285714,0.41666666666666663,0.8]
[{"$nulls":15},0.0803571428571429,0.41666666666666663,0.8]
[{"$nulls":15},0.0714285714285714,0.41666666666666663,0.8]
[{"$nulls":15},0.1160714285714286,0.41666666666666663,0.8]
[{"$nulls":15},0.0892857142857143,0.41666666666666663,0.8]
[{"$nulls":15},0.0803571428571429,0.41666666666666663,0.8]
[{"$nulls":15},0.0803571428571429,0.41666666666666663,0.8]
[{"$nulls":15},0.125,0.41666666666666663,0.8]
[{"$nulls":15},0.0535714285714286,0.41666666666666663,0.8]
[{"$nulls":15},0.1160714285714286,0.41666666666666663,0.8]
[{"$nulls":15},0.0892857142857143,0.41666666666666663,0.8]
[{"$nulls":15},0.0982142857142857,0.41666666666666663,0.8]
[{"$nulls":15},0.0625,0.41666666666666663,0.8]
[{"$nulls":15},0.0714285714285714,0.41666666666666663,0.8]
[{"$nulls":15},0.0625,0.41666666666666663,0.8]
[{"$nulls":15},0.0892857142857143,0.41666666666666663,0.8]
[{"$nulls":15},0.044642857142857095,0.41666666666666663,0.8]
[{"$nulls":15},0.0535714285714286,0.41666666666666663,0.8]
[{"$nulls":15},0.0803571428571429,0.41666666666666663,0.8]
[{"$nulls":15},0.0625,0.33333333333333337,0.8]
[{"$nulls":15},0.0803571428571429,0.41666666666666663,0.8]
[{"$nulls":15},0.0714285714285714,0.41666666666666663,0.8]
[{"$nulls":15},0.0714285714285714,0.41666666666666663,0.8]
[{"$nulls":15},0.0982142857142857,0.41666666666666663,0.8]
[{"$nulls":15},0.0357142857142857,0.08333333333333337,0.8]
[{"$nulls":15},0.0892857142857143,0.41666666666666663,0.8]
[{"$nulls":15},0.0892857142857143,0.41666666666666663,0.8]
[{"$nulls":15},0.0625,0.33333333333333337,0.8]
[{"$nulls":15},0.0803571428571429,0.41666666666666663,0.8]
[{"$nulls":15},0.0892857142857143,0.41666666666666663,0.8]
[{"$nulls":15},0.0535714285714286,0.33333333333333337,0.8]
[{"$nulls":15},0.1160714285714286,0.41666666666666663,0.8]
[{"$nulls":15},0.0625,0.41666666666666663,0.8]
[{"$nulls":15},0.0803571428571429,0.41666666666666663,0.8]
[{"$nulls":15},0.1071428571428571,0.41666666666666663,0.8]
[{"$nulls":15},0.0714285714285714,0.41666666666666663,0.8]
[{"$nulls":15},0.0714285714285714,0.41666666666666663,0.8]
[{"$nulls":15},0.0803571428571429,0.41666666666666663,0.8]
[{"$nulls":15},0.0892857142857143,0.41666666666666663,0.8]
[{"$nulls":15},0.0625,0.41666666666666663,0.8]
[{"$nulls":15},0.0714285714285714,0.41666666666666663,0.8]
[{"$nulls":15},0.0714285714285714,0.41666666666666663,0.8]
[{"$nulls":15},0.0803571428571429,0.41666666666666663,0.8]
[{"$nulls":15},0.0803571428571429,0.41666666666666663,0.8]
[{"$nulls":15},0.0803571428571429,0.41666666666666663,0.8]
[{"$nulls":15},0.0625,0.41666666666666663,0.8]
[{"$nulls":15},0.0982142857142857,0.41666666666666663,0.8]
[{"$nulls":15},0.0535714285714286,0.41666666666666663,0.8]
[{"$nulls":15},0.1071428571428571,0.41666666666666663,0.8]
[{"$nulls":15},0.0714285714285714,0.41666666666666663,0.8]
[{"$nulls":15},0.0892857142857143,0.41666666666666663,0.8]
[{"$nulls":15},0.044642857142857095,0.41666666666666663,0.8]
[{"$nulls":15},0.044642857142857095,0.41666666666666663,0.8]
[{"$nulls":15},0.0625,0.41666666666666663,0.8]
[{"$nulls":15},0.0803571428571429,0.41666666666666663,0.8]
[{"$nulls":15},0.0982142857142857,0.41666666666666663,0.8]
[{"$nulls":15},0.0625,0.41666666666666663,0.8]
[{"$nulls":15},0.0535714285714286,0.41666666666666663,0.8]
[{"$nulls":15},0.0625,0.41666666666666663,0.8]
[{"$nulls":15},0.044642857142857095,0.41666666666666663,0.8]
[{"$nulls":15},0.0625,0.41666666666666663,0.8]
[{"$nulls":15},0.0803571428571429,0.41666666666666663,0.8]
[{"$nulls":15},0.0892857142857143,0.41666666666666663,0.8]
[{"$nulls":15},0.0714285714285714,0.41666666666666663,0.8]
[{"$nulls":15},0.0714285714285714,0.41666666666666663,0.8]
[{"$nulls":15},0.0892857142857143,0.41666666666666663,0.8]
[{"$nulls":15},0.1160714285714286,0.41666666666666663,0.8]
[{"$nulls":15},0.0535714285714286,0.41666666666666663,0.8]
[{"$nulls":15},0.0803571428571429,0.41666666666666663,0.8]
[{"$nulls":15},0.0625,0.41666666666666663,0.8]
[{"$nulls":15},0.0982142857142857,0.41666666666666663,0.8]
[{"$nulls":15},0.0803571428571429,0.41666666666666663,0.8]
[{"$nulls":15},0.0803571428571429,0.41666666666666663,0.8]
[{"$nulls":15},0.0714285714285714,0.41666666666666663,0.8]
[{"$nulls":15},0.0714285714285714,0.41666666666666663,0.8]
[{"$nulls":15},0.0625,0.41666666666666663,0.8]
[{"$nulls":15},0.0714285714285714,0.41666666666666663,0.8]
[{"$nulls":15},0.0625,0.41666666666666663,0.8]
[{"$nulls":15},0.0803571428571429,0.41666666666666663,0.8]
[{"$nulls":15},0.0625,0.41666666666666663,0.8]
[{"$nulls":15},0.1071428571428571,0.41666666666666663,0.8]
[{"$nulls":15},0.0892857142857143,0.41666666666666663,0.8]
[{"$nulls":15},0.0625,0.41666666666666663,0.8]
[{"$nulls":15},0.125,0.41666666666666663,0.8]
[{"$nulls":15},0.0892857142857143,0.41666666666666663,0.8]
[{"$nulls":15},0.0982142857142857,0.41666666666666663,0.8]
[{"$nulls":15},0.0982142857142857,0.41666666666666663,0.8]
[{"$nulls":15},0.0982142857142857,0.41666666666666663,0.8]
[{"$nulls":15},0.0982142857142857,0.41666666666666663,0.8]
[{"$nulls":15},0.0803571428571429,0.41666666666666663,0.8]
[{"$nulls":15},0.0535714285714286,0.08333333333333337,0.8]
[{"$nulls":15},0.0803571428571429,0.41666666666666663,0.8]
[{"$nulls":15},0.0625,0.41666666666666663,0.8]
[{"$nulls":15},0.0803571428571429,0.41666666666666663,0.8]
[{"$nulls":15},0.0625,0.41666666666666663,0.8]
[{"$nulls":15},0.0982142857142857,0.41666666666666663,0.8]
[{"$nulls":15},0.0982142857142857,0.41666666666666663,0.8]
[{"$nulls":15},0.0714285714285714,0.41666666666666663,0.8]
[{"$nulls":15},0.0803571428571429,0.41666666666666663,0.8]
[{"$nulls":15},0.0714285714285714,0.41666666666666663,0.8]
[{"$nulls":15},0.125,0.41666666666666663,0.8]
[{"$nulls":15},0.0982142857142857,0.41666666666666663,0.8]
[{"$nulls":15},0.0535714285714286,0.33333333333333337,0.8]
[{"$nulls":15},0.0982142857142857,0.41666666666666663,0.8]
[{"$nulls":15},0.0714285714285714,0.41666666666666663,0.8]
[{"$nulls":15},0.0625,0.41666666666666663,0.8]
[{"$nulls":15},0.0982142857142857,0.41666666666666663,0.8]
[{"$nulls":15},0.0803571428571429,0.41666666666666663,0.8]
[{"$nulls":15},0.125,0.41666666666666663,0.8]
[{"$nulls":15},0.0535714285714286,0.41666666666666663,0.8]
[{"$nulls":15},0.0892857142857143,0.41666666666666663,0.8]
[{"$nulls":15},0.0714285714285714,0.41666666666666663,0.8]
[{"$nulls":15},0.0714285714285714,0.33333333333333337,0.8]
[{"$nulls":15},0.0714285714285714,0.41666666666666663,0.8]
[{"$nulls":15},0.0803571428571429,0.41666666666666663,0.8]
[{"$nulls":15},0.0803571428571429,0.41666666666666663,0.8]
[{"$nulls":15},0.0625,0.41666666666666663,0.8]
[{"$nulls":15},0.0892857142857143,0.41666666666666663,0.8]
[{"$nulls":15},0.0714285714285714,0.41666666666666663,0.8]
[{"$nulls":15},0.0803571428571429,0.41666666666666663,0.8]
[{"$nulls":15},0.0535714285714286,0.33333333333333337,0.8]
[{"$nulls":15},0.0625,0.41666666666666663,0.8]
[{"$nulls":15},0.0803571428571429,0.41666666666666663,0.8]
[{"$nulls":15},0.0714285714285714,0.41666666666666663,0.8]
[{"$nulls":15},0.0714285714285714,0.41666666666666663,0.8]
[{"$nulls":15},0.1428571428571429,0.41666666666666663,0.8]
[{"$nulls":15},0.0714285714285714,0.41666666666666663,0.8]
[{"$nulls":15},0.0535714285714286,0.41666666666666663,0.8]
[{"$nulls":15},0.0625,0.41666666666666663,0.8]
[{"$nulls":15},0.0625,0.41666666666666663,0.8]
[{"$nulls":15},0.0803571428571429,0.41666666666666663,0.8]
[{"$nulls":15},0.0357142857142857,0.25,0.8]
[{"$nulls":15},0.0803571428571429,0.41666666666666663,0.8]
[{"$nulls":15},0.0892857142857143,0.41666666666666663,0.8]
[{"$nulls":15},0.0803571428571429,0.41666666666666663,0.8]
[{"$nulls":15},0.0625,0.41666666666666663,0.8]
[{"$nulls":15},0.0803571428571429,0.41666666666666663,0.8]
[{"$nulls":15},0.0625,0.41666666666666663,0.8]
[{"$nulls":15},0.0714285714285714,0.41666666666666663,0.8]
[{"$nulls":15},0.0982142857142857,0.41666666666666663,0.8]
[{"$nulls":15},0.0714285714285714,0.41666666666666663,0.8]
[{"$nulls":15},0.0714285714285714,0.41666666666666663,0.8]
[{"$nulls":15},0.0803571428571429,0.41666666666666663,0.8]
[{"$nulls":15},0.0625,0.33333333333333337,0.8]
[{"$nulls":15},0.0892857142857143,0.41666666666666663,0.8]
[{"$nulls":15},0.0803571428571429,0.33333333333333337,0.8]
[{"$nulls":15},0.0714285714285714,0.41666666666666663,0.8]
[{"$nulls":15},0.0714285714285714,0.41666666666666663,0.8]
[{"$nulls":15},0.0714285714285714,0.41666666666666663,0.8]
[{"$nulls":15},0.0625,0.41666666666666663,0.8]
[{"$nulls":15},0.0803571428571429,0.41666666666666663,0.8]
[{"$nulls":15},0.0625,0.25,0.8]
[{"$nulls":15},0.0714285714285714,0.41666666666666663,0.8]
[{"$nulls":15},0.0982142857142857,0.41666666666666663,0.8]
[{"$nulls":15},0.0625,0.41666666666666663,0.8]
[{"$nulls":15},0.0803571428571429,0.41666666666666663,0.8]
[{"$nulls":15},0.0535714285714286,0.41666666666666663,0.8]
[{"$nulls":15},0.0892857142857143,0.41666666666666663,0.8]
[{"$nulls":15},0.0803571428571429,0.33333333333333337,0.8]
[{"$nulls":15},0.0892857142857143,0.41666666666666663,0.8]
[{"$nulls":15},0.0982142857142857,0.41666666666666663,0.8]
[{"$nulls":15},0.0714285714285714,0.41666666666666663,0.8]
[{"$nulls":15},0.0803571428571429,0.41666666666666663,0.8]
[{"$nulls":15},0.0535714285714286,0.41666666666666663,0.8]
[{"$nulls":15},0.1071428571428571,0.41666666666666663,0.8]
[{"$nulls":15},0.125,0.41666666666666663,0.8]
[{"$nulls":15},0.0892857142857143,0.41666666666666663,0.8]
[{"$nulls":15},0.1339285714285714,0.41666666666666663,0.8]
[{"$nulls":15},0.0892857142857143,0.41666666666666663,0.8]
[{"$nulls":15},0.044642857142857095,0.25,0.8]
[{"$nulls":15},0.0803571428571429,0.41666666666666663,0.8]
[{"$nulls":15},0.0535714285714286,0.33333333333333337,0.8]
[{"$nulls":15},0.1071428571428571,0.41666666666666663,0.8]
[{"$nulls":15},0.1696428571428571,0.8333333333333334,0.6]
[{"$nulls":15},0.2232142857142857,0.9166666666666666,0.6]
[{"$nulls":15},0.2321428571428571,0.75,0.6]
[{"$nulls":15},0.25,0.9166666666666666,0.6]
[{"$nulls":15},0.2321428571428571,0.9166666666666666,0.6]
[{"$nulls":15},0.2232142857142857,0.9166666666666666,0.6]
[{"$nulls":15},0.2053571428571429,0.9166666666666666,0.6]
[{"$nulls":15},0.2321428571428571,0.9166666666666666,0.6]
[{"$nulls":15},0.2053571428571429,0.9166666666666666,0.6]
[{"$nulls":15},0.1875,0.9166666666666666,0.6]
[{"$nulls":15},0.2232142857142857,0.8333333333333334,0.6]
[{"$nulls":15},0.2232142857142857,0.9166666666666666,0.6]
[{"$nulls":15},0.1428571428571429,0.5833333333333333,0.6]
[{"$nulls":15},0.2053571428571429,0.9166666666666666,0.6]
[{"$nulls":15},0.2053571428571429,0.9166666666666666,0.6]
[{"$nulls":15},0.1696428571428571,0.9166666666666666,0.6]
[{"$nulls":15},0.2142857142857143,0.9166666666666666,0.6]
[{"$nulls":15},0.2232142857142857,0.9166666666666666,0.6]
[{"$nulls":15},0.2232142857142857,0.8333333333333334,0.6]
[{"$nulls":15},0.2053571428571429,0.9166666666666666,0.6]
[{"$nulls":15},0.25,0.8333333333333334,0.6]
[{"$nulls":15},0.2053571428571429,0.9166666666666666,0.6]
[{"$nulls":15},0.2410714285714286,0.9166666666666666,0.6]
[{"$nulls":15},0.1696428571428571,0.9166666666666666,0.6]
[{"$nulls":15},0.1785714285714286,0.9166666666666666,0.6]
[{"$nulls":15},0.2053571428571429,0.9166666666666666,0.6]
[{"$nulls":15},0.2232142857142857,0.9166666666666666,0.6]
[{"$nulls":15},0.2053571428571429,0.9166666666666666,0.6]
[{"$nulls":15},0.2410714285714286,0.9166666666666666,0.6]
[{"$nulls":15},0.1964285714285714,0.9166666666666666,0.6]
[{"$nulls":15},0.2321428571428571,0.9166666666666666,0.6]
[{"$nulls":15},0.2232142857142857,0.9166666666666666,0.6]
[{"$nulls":15},0.1785714285714286,0.9166666666666666,0.6]
[{"$nulls":15},0.1339285714285714,0.5833333333333333,0.6]
[{"$nulls":15},0.1875,0.6666666666666667,0.6]
[{"$nulls":15},0.2678571428571429,0.9166666666666666,0.6]
[{"$nulls":15},0.1964285714285714,0.9166666666666666,0.6]
[{"$nulls":15},0.2589285714285714,0.9166666666666666,0.6]
[{"$nulls":15},0.1785714285714286,0.9166666666666666,0.6]
[{"$nulls":15},0.1696428571428571,0.41666666666666663,0.6]
[{"$nulls":15},0.1785714285714286,0.75,0.6]
[{"$nulls":15},0.2142857142857143,0.9166666666666666,0.6]
[{"$nulls":15},0.25,0.9166666666666666,0.6]
[{"$nulls":15},0.2142857142857143,0.75,0.6]
[{"$nulls":15},0.2232142857142857,0.9166666666666666,0.6]
[{"$nulls":15},0.2053571428571429,0.5,0.6]
[{"$nulls":15},0.2142857142857143,0.9166666666666666,0.6]
[{"$nulls":15},0.1875,0.5833333333333333,0.6]
[{"$nulls":15},0.2589285714285714,0.8333333333333334,0.6]
[{"$nulls":15},0.2589285714285714,0.9166666666666666,0.6]
[{"$nulls":15},0.2410714285714286,0.9166666666666666,0.6]
[{"$nulls":15},0.1785714285714286,0.5,0.6]
[{"$nulls":15},0.2232142857142857,0.9166666666666666,0.6]
[{"$nulls":15},0.2142857142857143,0.9166666666666666,0.6]
[{"$nulls":15},0.2410714285714286,0.8333333333333334,0.6]
[{"$nulls":15},0.2142857142857143,0.9166666666666666,0.6]
[{"$nulls":15},0.2053571428571429,0.9166666666666666,0.6]
[{"$nulls":15},0.2410714285714286,0.9166666666666666,0.6]
[{"$nulls":15},0.2410714285714286,0.9166666666666666,0.6]
[{"$nulls":15},0.1875,0.9166666666666666,0.6]
[{"$nulls":15},0.2053571428571429,0.9166666666666666,0.6]
[{"$nulls":15},0.25,0.9166666666666666,0.6]
[{"$nulls":15},0.2410714285714286,0.9166666666666666,0.6]
[{"$nulls":15},0.2232142857142857,0.9166666666666666,0.6]
[{"$nulls":15},0.2321428571428571,0.9166666666666666,0.6]
[{"$nulls":15},0.2678571428571429,0.9166666666666666,0.6]
[{"$nulls":15},0.2232142857142857,0.9166666666666666,0.6]
[{"$nulls":15},0.2232142857142857,0.9166666666666666,0.6]
[{"$nulls":15},0.2321428571428571,0.9166666666666666,0.6]
[{"$nulls":15},0.1875,0.9166666666666666,0.6]
[{"$nulls":15},0.2321428571428571,0.9166666666666666,0.6]
[{"$nulls":15},0.1607142857142857,0.5833333333333333,0.6]
[{"$nulls":15},0.2053571428571429,0.8333333333333334,0.6]
[{"$nulls":15},0.2053571428571429,0.9166666666666666,0.6]
[{"$nulls":15},0.1785714285714286,0.9166666666666666,0.6]
[{"$nulls":15},0.2142857142857143,0.9166666666666666,0.6]
[{"$nulls":15},0.1964285714285714,0.9166666666666666,0.6]
[{"$nulls":15},0.2410714285714286,0.9166666666666666,0.6]
[{"$nulls":15},0.1696428571428571,0.9166666666666666,0.6]
[{"$nulls":15},0.2053571428571429,0.9166666666666666,0.6]
[{"$nulls":15},0.2053571428571429,0.9166666666666666,0.6]
[{"$nulls":15},0.1696428571428571,0.9166666666666666,0.6]
[{"$nulls":15},0.2321428571428571,0.9166666666666666,0.6]
[{"$nulls":15},0.1964285714285714,0.9166666666666666,0.6]
[{"$nulls":15},0.2142857142857143,0.9166666666666666,0.6]
[{"$nulls":15},0.1875,0.9166666666666666,0.6]
[{"$nulls":15},0.2142857142857143,0.9166666666666666,0.6]
[{"$nulls":15},0.1875,0.9166666666666666,0.6]
[{"$nulls":15},0.2410714285714286,0.9166666666666666,0.6]
[{"$nulls":15},0.1964285714285714,0.9166666666666666,0.6]
[{"$nulls":15},0.2053571428571429,0.75,0.6]
[{"$nulls":15},0.2232142857142857,0.8333333333333334,0.6]
[{"$nulls":15},0.2053571428571429,0.9166666666666666,0.6]
[{"$nulls":15},0.2589285714285714,0.9166666666666666,0.6]
[{"$nulls":15},0.2321428571428571,0.75,0.6]
[{"$nulls":15},0.2589285714285714,0.8333333333333334,0.6]
[{"$nulls":15},0.2142857142857143,0.9166666666666666,0.6]
[{"$nulls":15},0.2232142857142857,0.9166666666666666,0.6]
[{"$nulls":15},0.2321428571428571,0.9166666666666666,0.6]
[{"$nulls":15},0.2232142857142857,0.9166666666666666,0.6]
[{"$nulls":15},0.2142857142857143,0.9166666666666666,0.6]
[{"$nulls":15},0.2142857142857143,0.8333333333333334,0.6]
[{"$nulls":15},0.2410714285714286,0.9166666666666666,0.6]
[{"$nulls":15},0.2321428571428571,0.9166666666666666,0.6]
[{"$nulls":15},0.0982142857142857,0.33333333333333337,0.6]
[{"$nulls":15},0.1160714285714286,0.5833333333333333,0.6]
[{"$nulls":15},0.25,0.9166666666666666,0.6]
[{"$nulls":15},0.2053571428571429,0.9166666666666666,0.6]
[{"$nulls":15},0.2053571428571429,0.9166666666666666,0.6]
[{"$nulls":15},0.2142857142857143,0.9166666666666666,0.6]
[{"$nulls":15},0.2142857142857143,0.9166666666666666,0.6]
[{"$nulls":15},0.2053571428571429,0.9166666666666666,0.6]
[{"$nulls":15},0.2321428571428571,0.9166666666666666,0.6]
[{"$nulls":15},0.2142857142857143,0.9166666666666666,0.6]
[{"$nulls":15},0.2321428571428571,0.9166666666666666,0.6]
[{"$nulls":15},0.2410714285714286,0.9166666666666666,0.6]
[{"$nulls":15},0.2321428571428571,0.9166666666666666,0.6]
[{"$nulls":15},0.2232142857142857,0.9166666666666666,0.6]
[{"$nulls":15},0.2321428571428571,0.9166666666666666,0.6]
[{"$nulls":15},0.2232142857142857,0.9166666666666666,0.6]
[{"$nulls":15},0.2232142857142857,0.9166666666666666,0.6]
[{"$nulls":15},0.2142857142857143,0.9166666666666666,0.6]
[{"$nulls":15},0.1875,0.5833333333333333,0.6]
[{"$nulls":15},0.2589285714285714,0.9166666666666666,0.6]
[{"$nulls":15},0.2142857142857143,0.75,0.6]
[{"$nulls":15},0.2410714285714286,0.9166666666666666,0.6]
[{"$nulls":15},0.2053571428571429,0.9166666666666666,0.6]
[{"$nulls":15},0.2142857142857143,0.8333333333333334,0.6]
[{"$nulls":15},0.1964285714285714,0.9166666666666666,0.6]
[{"$nulls":15},0.2053571428571429,0.9166666666666666,0.6]
[{"$nulls":15},0.2142857142857143,0.9166666666666666,0.6]
[{"$nulls":15},0.25,0.9166666666666666,0.6]
[{"$nulls":15},0.2232142857142857,0.8333333333333334,0.6]
[{"$nulls":15},0.2589285714285714,0.9166666666666666,0.6]
[{"$nulls":15},0.2142857142857143,0.9166666666666666,0.6]
[{"$nulls":15},0.2053571428571429,0.9166666666666666,0.6]
[{"$nulls":15},0.1875,0.9166666666666666,0.6]
[{"$nulls":15},0.2142857142857143,0.8333333333333334,0.6]
[{"$nulls":15},0.2053571428571429,0.9166666666666666,0.6]
[{"$nulls":15},0.1875,0.9166666666666666,0.6]
[{"$nulls":15},0.1964285714285714,0.75,0.6]
[{"$nulls":15},0.2232142857142857,0.9166666666666666,0.6]
[{"$nulls":15},0.2232142857142857,0.9166666666666666,0.6]
[{"$nulls":15},0.2142857142857143,0.9166666666666666,0.6]
[{"$nulls":15},0.2142857142857143,0.8333333333333334,0.6]
[{"$nulls":15},0.2053571428571429,0.75,0.6]
[{"$nulls":15},0.1875,0.9166666666666666,0.6]
[{"$nulls":15},0.2232142857142857,0.9166666666666666,0.6]
[{"$nulls":15},0.2142857142857143,0.9166666666666666,0.6]
[{"$nulls":15},0.2321428571428571,0.9166666666666666,0.6]
[{"$nulls":15},0.1696428571428571,0.9166666666666666,0.6]
[{"$nulls":15},0.25,0.9166666666666666,0.6]
[{"$nulls":15},0.1964285714285714,0.8333333333333334,0.6]
[{"$nulls":15},0.2142857142857143,0.9166666666666666,0.6]
[{"$nulls":15},0.2589285714285714,0.9166666666666666,0.6]
[{"$nulls":15},0.2142857142857143,0.75,0.6]
[{"$nulls":15},0.2142857142857143,0.9166666666666666,0.6]
[{"$nulls":15},0.2142857142857143,0.9166666666666666,0.6]
[{"$nulls":15},0.2410714285714286,0.9166666666666666,0.6]
[{"$nulls":15},0.1785714285714286,0.9166666666666666,0.6]
[{"$nulls":15},0.2321428571428571,0.9166666666666666,0.6]
[{"$nulls":15},0.2053571428571429,0.8333333333333334,0.6]
[{"$nulls":15},0.2321428571428571,0.9166666666666666,0.6]
[{"$nulls":15},0.25,0.9166666666666666,0.6]
[{"$nulls":15},0.2410714285714286,0.9166666666666666,0.6]
[{"$nulls":15},0.2053571428571429,0.9166666666666666,0.6]
[{"$nulls":15},0.2321428571428571,0.9166666666666666,0.6]
[{"$nulls":15},0.2053571428571429,0.9166666666666666,0.6]
[{"$nulls":15},0.2410714285714286,0.8333333333333334,0.6]
[{"$nulls":15},0.1964285714285714,0.9166666666666666,0.6]
[{"$nulls":15},0.1785714285714286,0.75,0.6]
[{"$nulls":15},0.2053571428571429,0.8333333333333334,0.6]
[{"$nulls":15},0.1428571428571429,0.5833333333333333,0.6]
[{"$nulls":15},0.2321428571428571,0.9166666666666666,0.6]
[{"$nulls":15},0.2142857142857143,0.8333333333333334,0.6]
[{"$nulls":15},0.1964285714285714,0.8333333333333334,0.6]
[{"$nulls":15},0.1964285714285714,0.9166666666666666,0.6]
[{"$nulls":15},0.25,0.8333333333333334,0.6]
[{"$nulls":15},0.2857142857142857,0.9166666666666666,0.6]
[{"$nulls":15},0.2321428571428571,0.8333333333333334,0.6]
[{"$nulls":15},0.1964285714285714,0.5833333333333333,0.6]
[{"$nulls":15},0.1875,0.9166666666666666,0.6]
[{"$nulls":15},0.1785714285714286,0.5833333333333333,0.6]
[{"$nulls":15},0.2053571428571429,0.9166666666666666,0.6]
[{"$nulls":15},0.1964285714285714,0.9166666666666666,0.6]
[{"$nulls":15},0.1607142857142857,0.75,0.6]
[{"$nulls":15},0.2053571428571429,0.9166666666666666,0.6]
[{"$nulls":15},0.2053571428571429,0.9166666666666666,0.6]
[{"$nulls":15},0.2142857142857143,0.8333333333333334,0.6]
[{"$nulls":15},0.1964285714285714,0.8333333333333334,0.6]
[{"$nulls":15},0.1696428571428571,0.6666666666666667,0.6]
[{"$nulls":15},0.2410714285714286,0.9166666666666666,0.6]
[{"$nulls":15},0.2321428571428571,0.9166666666666666,0.6]
[{"$nulls":15},0.2321428571428571,0.9166666666666666,0.6]
[{"$nulls":15},0.2321428571428571,0.9166666666666666,0.6]
[{"$nulls":15},0.1964285714285714,0.9166666666666666,0.6]
[{"$nulls":15},0.2410714285714286,0.9166666666666666,0.6]
[{"$nulls":15},0.2678571428571429,0.9166666666666666,0.6]
[{"$nulls":15},0.2232142857142857,0.75,0.6]
[{"$nulls":15},0.25,0.9166666666666666,0.6]

{"sheet":"random","index":13,"n_rows":81,"n_cols":26,"rows_kept":81}
[{"$f":"AVERAGE(trust2!B2:'trust2'!G81)","v":0.7261647430283127},{"$f":"AVERAGE(trust2!B2:'trust2'!B81)","v":0.7722424001476507},{"$f":"AVERAGE(trust2!C2:'trust2'!C81)","v":0.803076044746779},{"$f":"AVERAGE(trust2!D2:'trust2'!D81)","v":0.7474811976837249},{"$f":"AVERAGE(trust2!E2:'trust2'!E81)","v":0.7580849699692649},{"$f":"AVERAGE(trust2!F2:'trust2'!F81)","v":0.631799940848273},{"$f":"AVERAGE(trust2!G2:'trust2'!G81)","v":0.6443039047741862},{"$f":"AVERAGE(trust2!H2:'trust2'!H81)","v":{"$error":"#DIV/0!"}},{"$f":"AVERAGE(trust2!I2:'trust2'!I81)","v":{"$error":"#DIV/0!"}},{"$f":"AVERAGE(#REF!:#REF!)","v":{"$error":"#REF!"}},{"$f":"AVERAGE(#REF!:#REF!)","v":{"$error":"#REF!"}},{"$f":"AVERAGE(#REF!:#REF!)","v":{"$error":"#REF!"}},{"$f":"AVERAGE(#REF!:#REF!)","v":{"$error":"#REF!"}},{"$f":"AVERAGE(#REF!:#REF!)","v":{"$error":"#REF!"}},{"$f":"AVERAGE(#REF!:#REF!)","v":{"$error":"#REF!"}},{"$f":"AVERAGE(#REF!:#REF!)","v":{"$error":"#REF!"}},{"$f":"AVERAGE(#REF!:#REF!)","v":{"$error":"#REF!"}},{"$f":"AVERAGE(#REF!:#REF!)","v":{"$error":"#REF!"}},{"$f":"AVERAGE(#REF!:#REF!)","v":{"$error":"#REF!"}},{"$f":"AVERAGE(#REF!:#REF!)","v":{"$error":"#REF!"}},{"$f":"AVERAGE(#REF!:#REF!)","v":{"$error":"#REF!"}},{"$f":"AVERAGE(#REF!:#REF!)","v":{"$error":"#REF!"}},{"$f":"AVERAGE(#REF!:#REF!)","v":{"$error":"#REF!"}},{"$f":"AVERAGE(#REF!:#REF!)","v":{"$error":"#REF!"}},{"$f":"AVERAGE(#REF!:#REF!)","v":{"$error":"#REF!"}},{"$f":"AVERAGE(#REF!:#REF!)","v":{"$error":"#REF!"}}]
[{"$f":"AVERAGE(trust2!B2:'trust2'!G2)","v":{"v":0.7490199780466421,"d":"0.75"}},{"v":-0.17826961588974752,"d":"-0.18"},{"v":0.13853458352875495,"d":"0.14"},{"v":-0.1396401295931801,"d":"-0.14"},{"v":-0.07934512107752181,"d":"-0.08"},{"v":0.16224662122420178,"d":"0.16"},{"v":0.072045011455581,"d":"0.07"}]
[{"$f":"AVERAGE(trust2!B3:'trust2'!G3)","v":{"v":0.7915334754347075,"d":"0.79"}},{"v":-0.05604074290489768,"d":"-0.06"},{"v":0.08949305723163617,"d":"0.09"},{"v":-0.015746513710725867,"d":"-0.02"},{"v":-0.06937349259679725,"d":"-0.07"},{"v":0.06517843008380872,"d":"0.07"},{"v":-0.015761872971203992,"d":"-0.02"}]
[{"$f":"AVERAGE(trust2!B4:'trust2'!G4)","v":{"v":0.6811141765095284,"d":"0.68"}},{"v":-0.06100310849988277,"d":"-0.06"},{"v":0.10612683635012342,"d":"0.11"},{"v":-0.11204539377933997,"d":"-0.11"},{"v":-0.2440429647923689,"d":"-0.24"},{"v":0.05643505717356897,"d":"0.06"},{"v":0.23487039347959976,"d":"0.23"}]
[{"$f":"AVERAGE(trust2!B5:'trust2'!G5)","v":{"v":0.6141010292268712,"d":"0.61"}},{"v":-0.18353216903883032,"d":"-0.18"},{"v":0.20307855927128543,"d":"0.20"},{"v":-0.4167434157487257,"d":"-0.42"},{"v":-0.026810113978559615,"d":"-0.03"},{"v":0.13406086814297058,"d":"0.13"},{"v":0.2806440664728064,"d":"0.28"}]
[{"$f":"AVERAGE(trust2!B6:'trust2'!G6)","v":{"v":0.6650089471929416,"d":"0.67"}},{"v":-0.14970758026237377,"d":"-0.15"},{"v":0.14736788380951685,"d":"0.15"},{"v":-0.25834059142005084,"d":"-0.26"},{"v":-0.17913082381875634,"d":"-0.18"},{"v":0.15195770358149338,"d":"0.15"},{"v":0.26314197985252563,"d":"0.26"}]
[{"$f":"AVERAGE(trust2!B7:'trust2'!G7)","v":{"v":0.654580217157166,"d":"0.65"}},{"v":-0.13123574948280484,"d":"-0.13"},{"v":-0.0316074267033358,"d":"-0.03"},{"v":-0.11583967271347774,"d":"-0.12"},{"v":-0.15661869103498147,"d":"-0.16"},{"v":0.18701379458095824,"d":"0.19"},{"v":0.21541084178483727,"d":"0.22"}]
[{"$f":"AVERAGE(trust2!B8:'trust2'!G8)","v":{"v":0.7500065636517851,"d":"0.75"}},{"v":-0.19879917072092335,"d":"-0.20"},{"v":0.16701782684164398,"d":"0.17"},{"v":-0.17275945183293073,"d":"-0.17"},{"v":-0.04454831706229042,"d":"-0.04"},{"v":0.0844442897712089,"d":"0.08"},{"v":0.14398709771972112,"d":"0.14"}]
[{"$f":"AVERAGE(trust2!B9:'trust2'!G9)","v":{"v":0.6658089279228201,"d":"0.67"}},{"v":-0.22831744609498825,"d":"-0.23"},{"v":0.078268838193702,"d":"0.08"},{"v":-0.1278386521518174,"d":"-0.13"},{"v":-0.13436375280271415,"d":"-0.13"},{"v":0.1183932434486628,"d":"0.12"},{"v":0.26474085167950945,"d":"0.26"}]
[{"$f":"AVERAGE(trust2!B10:'trust2'!G10)","v":{"v":0.697175064833508,"d":"0.70"}},{"v":-0.21404176735822605,"d":"-0.21"},{"v":0.14297562501575975,"d":"0.14"},{"v":-0.3069058499366064,"d":"-0.31"},{"v":-0.23599631961199766,"d":"-0.24"},{"v":0.31775970421555233,"d":"0.32"},{"v":0.24659492725424445,"d":"0.25"}]
[{"$f":"AVERAGE(trust2!B11:'trust2'!G11)","v":{"v":0.7656628505091628,"d":"0.77"}},{"v":0.09600044120325518,"d":"0.10"},{"v":0.010355718485685608,"d":"0.01"},{"v":0.048820296296577755,"d":"0.05"},{"v":-0.08281438730327528,"d":"-0.08"},{"v":-0.05582631919479362,"d":"-0.06"},{"v":-0.004418794421141225,"d":"-0.00"}]
[{"$f":"AVERAGE(trust2!B12:'trust2'!G12)","v":{"v":0.6269756903023457,"d":"0.63"}},{"v":0.05108559835849497,"d":"0.05"},{"v":0.20395988546339772,"d":"0.20"},{"v":-0.0538262581651613,"d":"-0.05"},{"v":-0.08214665797038201,"d":"-0.08"},{"v":-0.2393399966687009,"d":"-0.24"},{"v":0.1379538583095856,"d":"0.14"}]
[{"$f":"AVERAGE(trust2!B13:'trust2'!G13)","v":{"v":0.7066424785224431,"d":"0.71"}},{"v":-0.1430844609881161,"d":"-0.14"},{"v":0.13887987695051368,"d":"0.14"},{"v":-0.12910898234476686,"d":"-0.13"},{"v":-0.1064957561611216,"d":"-0.11"},{"v":0.07895534828970235,"d":"0.08"},{"v":0.1448656333379452,"d":"0.14"}]
[{"$f":"AVERAGE(trust2!B14:'trust2'!G14)","v":{"v":0.6985534399044427,"d":"0.70"}},{"v":-0.2844027284586327,"d":"-0.28"},{"v":0.2266462372263501,"d":"0.23"},{"v":-0.2214376931413621,"d":"-0.22"},{"v":-0.17771817481049834,"d":"-0.18"},{"v":0.1642018013112095,"d":"0.16"},{"v":0.26096663530829506,"d":"0.26"}]
[{"$f":"AVERAGE(trust2!B15:'trust2'!G15)","v":{"v":0.7306452576660774,"d":"0.73"}},{"v":0.023166537623107063,"d":"0.02"},{"v":-0.06151264432562498,"d":"-0.06"},{"v":0.02360062030353435,"d":"0.02"},{"v":0.04288351126553039,"d":"0.04"},{"v":-0.011019166801898848,"d":"-0.01"},{"v":-0.01768832664214656,"d":"-0.02"}]
[{"$f":"AVERAGE(trust2!B16:'trust2'!G16)","v":{"v":0.7242621599137483,"d":"0.72"}},{"v":0.10925951048944589,"d":"0.11"},{"v":-0.07517481639452679,"d":"-0.08"},{"v":0.10613735798507454,"d":"0.11"},{"v":0.1102312712134424,"d":"0.11"},{"v":-0.09388798524517107,"d":"-0.09"},{"v":-0.13316557568669565,"d":"-0.13"}]
[{"$f":"AVERAGE(trust2!B17:'trust2'!G17)","v":{"v":0.6907657947375981,"d":"0.69"}},{"v":0.05363098865155262,"d":"0.05"},{"v":-0.08783946106472892,"d":"-0.09"},{"v":0.10128437650086651,"d":"0.10"},{"v":0.13101378937127395,"d":"0.13"},{"v":-0.14634946228533688,"d":"-0.15"},{"v":-0.038755552126665066,"d":"-0.04"}]
[{"$f":"AVERAGE(trust2!B18:'trust2'!G18)","v":{"v":0.7559083560925322,"d":"0.76"}},{"v":0.19263159134560126,"d":"0.19"},{"v":0.07451434821336018,"d":"0.07"},{"v":0.11863840933801216,"d":"0.12"},{"v":0.05591156335646601,"d":"0.06"},{"v":-0.24407953123502246,"d":"-0.24"},{"v":-0.13301209237785577,"d":"-0.13"}]
[{"$f":"AVERAGE(trust2!B19:'trust2'!G19)","v":{"v":0.7939176642219428,"d":"0.79"}},{"v":0.1015675739552963,"d":"0.10"},{"v":0.07199097021088016,"d":"0.07"},{"v":0.16162417545077426,"d":"0.16"},{"v":0.13022977268263777,"d":"0.13"},{"v":-0.15625742620250999,"d":"-0.16"},{"v":-0.23509470953979356,"d":"-0.24"}]
[{"$f":"AVERAGE(trust2!B20:'trust2'!G20)","v":{"v":0.7042308901291162,"d":"0.70"}},{"v":0.10971221984273563,"d":"0.11"},{"v":-0.1310805085809001,"d":"-0.13"},{"v":0.08097544522520977,"d":"0.08"},{"v":0.04601840874793873,"d":"0.05"},{"v":-0.047010927747529935,"d":"-0.05"},{"v":-0.055179647027509146,"d":"-0.06"}]
[{"$f":"AVERAGE(trust2!B21:'trust2'!G21)","v":{"v":0.7068963184707018,"d":"0.71"}},{"v":0.16939657513544132,"d":"0.17"},{"v":-0.09410325359117529,"d":"-0.09"},{"v":0.1020303275774875,"d":"0.10"},{"v":0.09849147754225257,"d":"0.10"},{"v":-0.12482329017077531,"d":"-0.12"},{"v":-0.12725321790185398,"d":"-0.13"}]
[{"$f":"AVERAGE(trust2!B22:'trust2'!G22)","v":{"v":0.7847812929007931,"d":"0.78"}},{"v":0.13921895876539972,"d":"0.14"},{"v":0.05002218843307789,"d":"0.05"},{"v":0.14743269600504486,"d":"0.15"},{"v":0.17801922976721962,"d":"0.18"},{"v":-0.22706461395062877,"d":"-0.23"},{"v":-0.20886887176068325,"d":"-0.21"}]
[{"$f":"AVERAGE(trust2!B23:'trust2'!G23)","v":{"v":0.751718699586908,"d":"0.75"}},{"v":0.04830725457147292,"d":"0.05"},{"v":0.018126617611726743,"d":"0.02"},{"v":0.09286108463159407,"d":"0.09"},{"v":0.08917072715327445,"d":"0.09"},{"v":-0.10151756132410986,"d":"-0.10"},{"v":-0.11472621804680211,"d":"-0.11"}]
[{"$f":"AVERAGE(trust2!B24:'trust2'!G24)","v":{"v":0.7609678948916535,"d":"0.76"}},{"v":0.06817310413861218,"d":"0.07"},{"v":-0.04722778416136537,"d":"-0.05"},{"v":0.0581022526122026,"d":"0.06"},{"v":0.07448052408829128,"d":"0.07"},{"v":-0.10975322150885931,"d":"-0.11"},{"v":-0.025856870069917864,"d":"-0.03"}]
[{"$f":"AVERAGE(trust2!B25:'trust2'!G25)","v":{"v":0.7454950621838963,"d":"0.75"}},{"v":0.10329088169166017,"d":"0.10"},{"v":0.025138664908607968,"d":"0.03"},{"v":0.11361351705754136,"d":"0.11"},{"v":0.11211818566943733,"d":"0.11"},{"v":-0.1297228795458954,"d":"-0.13"},{"v":-0.17906562571959153,"d":"-0.18"}]
[{"$f":"AVERAGE(trust2!B26:'trust2'!G26)","v":{"v":0.7284893709383596,"d":"0.73"}},{"v":0.03602952460197306,"d":"0.04"},{"v":-0.09417776214846654,"d":"-0.09"},{"v":0.0905033006775797,"d":"0.09"},{"v":0.10013111235044064,"d":"0.10"},{"v":-0.10942464512594023,"d":"-0.11"},{"v":-0.014295733975961131,"d":"-0.01"}]
[{"$f":"AVERAGE(trust2!B27:'trust2'!G27)","v":{"v":0.6536742945353436,"d":"0.65"}},{"v":-0.2506451359835499,"d":"-0.25"},{"v":-0.07376672952424129,"d":"-0.07"},{"v":-0.09099232157847417,"d":"-0.09"},{"v":-0.12223910869816043,"d":"-0.12"},{"v":0.13221725787380015,"d":"0.13"},{"v":0.3616954880831136,"d":"0.36"}]
[{"$f":"AVERAGE(trust2!B28:'trust2'!G28)","v":{"v":0.7091282388847254,"d":"0.71"}},{"v":0.10887207486923588,"d":"0.11"},{"v":-0.07766562536269647,"d":"-0.08"},{"v":0.1074943542127232,"d":"0.11"},{"v":-0.024131843336863967,"d":"-0.02"},{"v":-0.14679876948197296,"d":"-0.15"},{"v":0.040395940660603216,"d":"0.04"}]
[{"$f":"AVERAGE(trust2!B29:'trust2'!G29)","v":{"v":0.7455931761803646,"d":"0.75"}},{"v":0.05426990451966359,"d":"0.05"},{"v":-0.06555853664546936,"d":"-0.07"},{"v":0.10381424523647609,"d":"0.10"},{"v":0.11019195012497962,"d":"0.11"},{"v":-0.156863599314953,"d":"-0.16"},{"v":-0.025160722550412296,"d":"-0.03"}]
[{"$f":"AVERAGE(trust2!B30:'trust2'!G30)","v":{"v":0.7746561661013268,"d":"0.77"}},{"v":0.09332271059200879,"d":"0.09"},{"v":-0.09716030312207308,"d":"-0.10"},{"v":0.18403886349468096,"d":"0.18"},{"v":0.22277651416580652,"d":"0.22"},{"v":-0.19945514788567814,"d":"-0.20"},{"v":-0.15516224907917414,"d":"-0.16"}]
[{"$f":"AVERAGE(trust2!B31:'trust2'!G31)","v":{"v":0.7406015622602332,"d":"0.74"}},{"v":0.09626226436603838,"d":"0.10"},{"v":-0.17301029412259838,"d":"-0.17"},{"v":0.08818122604660547,"d":"0.09"},{"v":0.10538628977402066,"d":"0.11"},{"v":-0.0770546162638649,"d":"-0.08"},{"v":-0.03643503964335267,"d":"-0.04"}]
[{"$f":"AVERAGE(trust2!B32:'trust2'!G32)","v":{"v":0.6880463448902173,"d":"0.69"}},{"v":-0.005310966754004249,"d":"-0.01"},{"v":-0.08957968975559572,"d":"-0.09"},{"v":0.029368174679687515,"d":"0.03"},{"v":0.0493719654038067,"d":"0.05"},{"v":-0.05266586380433564,"d":"-0.05"},{"v":0.06209626818006761,"d":"0.06"}]
[{"$f":"AVERAGE(trust2!B33:'trust2'!G33)","v":{"v":0.804435350762703,"d":"0.80"}},{"v":0.03158333053335867,"d":"0.03"},{"v":0.09354465406213594,"d":"0.09"},{"v":0.13986175605610116,"d":"0.14"},{"v":0.12028580954231474,"d":"0.12"},{"v":-0.12574616344188433,"d":"-0.13"},{"v":-0.19466681736807956,"d":"-0.19"}]
[{"$f":"AVERAGE(trust2!B34:'trust2'!G34)","v":{"v":0.8019095315717403,"d":"0.80"}},{"v":-0.014168385913023884,"d":"-0.01"},{"v":0.05379032045485351,"d":"0.05"},{"v":0.09535477696310997,"d":"0.10"},{"v":0.11158216887179497,"d":"0.11"},{"v":-0.0968680480217702,"d":"-0.10"},{"v":-0.10958378618497906,"d":"-0.11"}]
[{"$f":"AVERAGE(trust2!B35:'trust2'!G35)","v":{"v":0.7476208130931048,"d":"0.75"}},{"v":0.07796011126250567,"d":"0.08"},{"v":-0.016503939408017435,"d":"-0.02"},{"v":0.12597639555169143,"d":"0.13"},{"v":0.10532245204043722,"d":"0.11"},{"v":-0.17729051825562417,"d":"-0.18"},{"v":-0.08009928611624854,"d":"-0.08"}]
[{"$f":"AVERAGE(trust2!B36:'trust2'!G36)","v":{"v":0.7789048392379753,"d":"0.78"}},{"v":0.0905508313706361,"d":"0.09"},{"v":0.08333962439743371,"d":"0.08"},{"v":0.07528719016289377,"d":"0.08"},{"v":0.08824700899121517,"d":"0.09"},{"v":-0.19503005020688002,"d":"-0.20"},{"v":-0.08729923162138573,"d":"-0.09"}]
[{"$f":"AVERAGE(trust2!B37:'trust2'!G37)","v":{"v":0.7281389102379401,"d":"0.73"}},{"v":0.041071355430748864,"d":"0.04"},{"v":-0.0557928846466967,"d":"-0.06"},{"v":0.08992563459028659,"d":"0.09"},{"v":-2.6766367302463426E-3,"d":"-0.00"},{"v":-0.013718038385639886,"d":"-0.01"},{"v":-0.054712115904554236,"d":"-0.05"}]
[{"$f":"AVERAGE(trust2!B38:'trust2'!G38)","v":{"v":0.6295151981011569,"d":"0.63"}},{"v":-0.1959834242442444,"d":"-0.20"},{"v":0.21622621176977547,"d":"0.22"},{"v":-0.35469644919463145,"d":"-0.35"},{"v":-0.2665049079133564,"d":"-0.27"},{"v":0.2637107853535871,"d":"0.26"},{"v":0.31495248518893315,"d":"0.31"}]
[{"$f":"AVERAGE(trust2!B39:'trust2'!G39)","v":{"v":0.5931818337500298,"d":"0.59"}},{"v":-0.42464570188794526,"d":"-0.42"},{"v":-0.11523111821928607,"d":"-0.12"},{"v":-0.3688440276785551,"d":"-0.37"},{"v":0.11806798921005542,"d":"0.12"},{"v":0.2783737484667108,"d":"0.28"},{"v":0.47849628050908766,"d":"0.48"}]
[{"$f":"AVERAGE(trust2!B40:'trust2'!G40)","v":{"v":0.6340095599007969,"d":"0.63"}},{"v":-0.17267338021797599,"d":"-0.17"},{"v":0.05466894992054913,"d":"0.05"},{"v":-0.241737201453927,"d":"-0.24"},{"v":-0.13461152932850634,"d":"-0.13"},{"v":0.2247166125359745,"d":"0.22"},{"v":0.24350096677096358,"d":"0.24"}]
[{"$f":"AVERAGE(trust2!B41:'trust2'!G41)","v":{"v":0.7456083488822861,"d":"0.75"}},{"v":0.04884290275082191,"d":"0.05"},{"v":-0.045779112856845,"d":"-0.05"},{"v":0.025371039755604403,"d":"0.03"},{"v":0.0192759801975726,"d":"0.02"},{"v":0.007994801142418516,"d":"0.01"},{"v":-0.052458836380837856,"d":"-0.05"}]
[{"$f":"AVERAGE(trust2!B42:'trust2'!G42)","v":{"v":0.767705636069604,"d":"0.77"}},{"v":7.400676633448032E-3,"d":"0.01"},{"v":-0.07343071929284743,"d":"-0.07"},{"v":0.061352840935449564,"d":"0.06"},{"v":0.02162447202067862,"d":"0.02"},{"v":0.039075019032028466,"d":"0.04"},{"v":-0.06004377521780888,"d":"-0.06"}]
[{"$f":"AVERAGE(trust2!B43:'trust2'!G43)","v":{"v":0.6671826773741351,"d":"0.67"}},{"v":0.023026977308035268,"d":"0.02"},{"v":-0.13780863460657866,"d":"-0.14"},{"v":-6.0893254040377725E-3,"d":"-0.01"},{"v":-0.019562280465499883,"d":"-0.02"},{"v":0.0623847405945569,"d":"0.06"},{"v":0.0600778916761252,"d":"0.06"}]
[{"$f":"AVERAGE(trust2!B44:'trust2'!G44)","v":{"v":0.6859557689087895,"d":"0.69"}},{"v":0.026556567401361048,"d":"0.03"},{"v":-0.06898061937187536,"d":"-0.07"},{"v":0.006867543943330338,"d":"0.01"},{"v":-0.04045476394675361,"d":"-0.04"},{"v":0.0700516541979035,"d":"0.07"},{"v":-4.474903380828241E-3,"d":"-0.00"}]
[{"$f":"AVERAGE(trust2!B45:'trust2'!G45)","v":{"v":0.6881797704408307,"d":"0.69"}},{"v":0.10661458446890637,"d":"0.11"},{"v":0.021250211541851288,"d":"0.02"},{"v":-0.045385718513909816,"d":"-0.05"},{"v":0.021859411850782044,"d":"0.02"},{"v":-0.03184557481674993,"d":"-0.03"},{"v":-0.059489040950369304,"d":"-0.06"}]
[{"$f":"AVERAGE(trust2!B46:'trust2'!G46)","v":{"v":0.7860436824959044,"d":"0.79"}},{"v":0.13988234799362792,"d":"0.14"},{"v":-0.19538467409858898,"d":"-0.20"},{"v":0.05285107254877596,"d":"0.05"},{"v":0.0669102510804618,"d":"0.07"},{"v":-0.09329434980540693,"d":"-0.09"},{"v":0.02708908720515571,"d":"0.03"}]
[{"$f":"AVERAGE(trust2!B47:'trust2'!G47)","v":{"v":0.6957825950931644,"d":"0.70"}},{"v":-0.03153254156361486,"d":"-0.03"},{"v":-0.067629616024541,"d":"-0.07"},{"v":-0.09598019311147243,"d":"-0.10"},{"v":-0.09099026265437267,"d":"-0.09"},{"v":0.10044342185686414,"d":"0.10"},{"v":0.15562926490855178,"d":"0.16"}]
[{"$f":"AVERAGE(trust2!B48:'trust2'!G48)","v":{"v":0.747320980603878,"d":"0.75"}},{"v":-0.06374490728301947,"d":"-0.06"},{"v":-0.17815122759057977,"d":"-0.18"},{"v":0.07223790882030212,"d":"0.07"},{"v":-0.01575097229920454,"d":"-0.02"},{"v":0.09993185851040692,"d":"0.10"},{"v":0.04815387019228126,"d":"0.05"}]
[{"$f":"AVERAGE(trust2!B49:'trust2'!G49)","v":{"v":0.7406639024684117,"d":"0.74"}},{"v":0.07652560489534473,"d":"0.08"},{"v":-0.20882352752487512,"d":"-0.21"},{"v":0.0960555934030392,"d":"0.10"},{"v":0.03357713364983944,"d":"0.03"},{"v":-0.0346210709353687,"d":"-0.03"},{"v":0.023522658996919608,"d":"0.02"}]
[{"$f":"AVERAGE(trust2!B50:'trust2'!G50)","v":{"v":0.7252951019091468,"d":"0.73"}},{"v":0.024826635033773886,"d":"0.02"},{"v":-0.07338029631011037,"d":"-0.07"},{"v":1.5449684421248058E-3,"d":"0.00"},{"v":0.026388197454496963,"d":"0.03"},{"v":0.038275649231040626,"d":"0.04"},{"v":-0.024320795875686183,"d":"-0.02"}]
[{"$f":"AVERAGE(trust2!B51:'trust2'!G51)","v":{"v":0.7620385854567459,"d":"0.76"}},{"v":0.15308862814378466,"d":"0.15"},{"v":-0.25716397910554367,"d":"-0.26"},{"v":0.18577519585948885,"d":"0.19"},{"v":0.16485425234443798,"d":"0.16"},{"v":-0.10229114526809407,"d":"-0.10"},{"v":-0.12947742130426915,"d":"-0.13"}]
[{"$f":"AVERAGE(trust2!B52:'trust2'!G52)","v":{"v":0.6572905419158162,"d":"0.66"}},{"v":-0.08445882574565375,"d":"-0.08"},{"v":-0.15230576540354354,"d":"-0.15"},{"v":0.0814646066070589,"d":"0.08"},{"v":0.06785915452130344,"d":"0.07"},{"v":0.07396128556578621,"d":"0.07"},{"v":-0.003054388547891455,"d":"-0.00"}]
[{"$f":"AVERAGE(trust2!B53:'trust2'!G53)","v":{"v":0.7586160419627416,"d":"0.76"}},{"v":0.18221412181423205,"d":"0.18"},{"v":0.018242321265551736,"d":"0.02"},{"v":0.004244286116273669,"d":"0.00"},{"v":0.1333937914235725,"d":"0.13"},{"v":-0.09296134165484668,"d":"-0.09"},{"v":-0.19674247588270774,"d":"-0.20"}]
[{"$f":"AVERAGE(trust2!B54:'trust2'!G54)","v":{"v":0.7034220686502305,"d":"0.70"}},{"v":0.04511501737865496,"d":"0.05"},{"v":-0.2790321861604575,"d":"-0.28"},{"v":-0.06904469179714039,"d":"-0.07"},{"v":0.06380272166260308,"d":"0.06"},{"v":0.057150003980397227,"d":"0.06"},{"v":0.1433863964460968,"d":"0.14"}]
[{"$f":"AVERAGE(trust2!B55:'trust2'!G55)","v":{"v":0.6304311407028771,"d":"0.63"}},{"v":0.10180798946395879,"d":"0.10"},{"v":-0.1097804245837795,"d":"-0.11"},{"v":-0.02834321223501564,"d":"-0.03"},{"v":-0.05637006992185065,"d":"-0.06"},{"v":0.11438490914123009,"d":"0.11"},{"v":-0.030630377828112485,"d":"-0.03"}]
[{"$f":"AVERAGE(trust2!B56:'trust2'!G56)","v":{"v":0.6784233526469802,"d":"0.68"}},{"v":-0.009973875132910877,"d":"-0.01"},{"v":-0.2428735112166649,"d":"-0.24"},{"v":0.16550945431113293,"d":"0.17"},{"v":0.037127331487128885,"d":"0.04"},{"v":-0.07425077342888109,"d":"-0.07"},{"v":0.10484569085627454,"d":"0.10"}]
[{"$f":"AVERAGE(trust2!B57:'trust2'!G57)","v":{"v":0.8107237040501799,"d":"0.81"}},{"v":0.20004307554405412,"d":"0.20"},{"v":0.050466280057393086,"d":"0.05"},{"v":0.2052501802319854,"d":"0.21"},{"v":0.060370898448513066,"d":"0.06"},{"v":-0.1538898563505992,"d":"-0.15"},{"v":-0.2762229729119744,"d":"-0.28"}]
[{"$f":"AVERAGE(trust2!B58:'trust2'!G58)","v":{"v":0.7353565362508719,"d":"0.74"}},{"v":0.016083274998185983,"d":"0.02"},{"v":-0.02809048423718371,"d":"-0.03"},{"v":0.03625169946551363,"d":"0.04"},{"v":-0.03816399098035434,"d":"-0.04"},{"v":0.01582841388029362,"d":"0.02"},{"v":-0.005488082734267437,"d":"-0.01"}]
[{"$f":"AVERAGE(trust2!B59:'trust2'!G59)","v":{"v":0.7918294018732932,"d":"0.79"}},{"v":0.046789220838668856,"d":"0.05"},{"v":0.08890957350053616,"d":"0.09"},{"v":0.11236318544339198,"d":"0.11"},{"v":0.14705760061588116,"d":"0.15"},{"v":0.04558406189344575,"d":"0.05"},{"v":-0.3788258133288257,"d":"-0.38"}]
[{"$f":"AVERAGE(trust2!B60:'trust2'!G60)","v":{"v":0.7780105345003768,"d":"0.78"}},{"v":-0.15747081041555003,"d":"-0.16"},{"v":0.4270881969470607,"d":"0.43"},{"v":0.03608065889431032,"d":"0.04"},{"v":-0.6997195810419529,"d":"-0.70"},{"v":0.3044070169904699,"d":"0.30"},{"v":0.06026560942422727,"d":"0.06"}]
[{"$f":"AVERAGE(trust2!B61:'trust2'!G61)","v":{"v":0.8579569537515265,"d":"0.86"}},{"v":0.05903822852183349,"d":"0.06"},{"v":0.03303990852318011,"d":"0.03"},{"v":0.08713661004907927,"d":"0.09"},{"v":0.10233769880797754,"d":"0.10"},{"v":0.10927514759384623,"d":"0.11"},{"v":-0.3401671683023191,"d":"-0.34"}]
[{"$f":"AVERAGE(trust2!B62:'trust2'!G62)","v":{"v":0.7908659031479736,"d":"0.79"}},{"v":0.07056584522963184,"d":"0.07"},{"v":0.05524706912640431,"d":"0.06"},{"v":0.08550361635108508,"d":"0.09"},{"v":0.02361791130922797,"d":"0.02"},{"v":0.07463626514323785,"d":"0.07"},{"v":-0.2725610509552702,"d":"-0.27"}]
[{"$f":"AVERAGE(trust2!B63:'trust2'!G63)","v":{"v":0.485592731906945,"d":"0.49"}},{"v":-0.048518826367040906,"d":"-0.05"},{"v":-0.1541167808575055,"d":"-0.15"},{"v":-0.6085812170879306,"d":"-0.61"},{"v":0.01860393210716296,"d":"0.02"},{"v":0.48413944581632845,"d":"0.48"},{"v":0.33148074493295654,"d":"0.33"}]
[{"$f":"AVERAGE(trust2!B64:'trust2'!G64)","v":{"v":0.6875852721496991,"d":"0.69"}},{"v":0.03814216534377303,"d":"0.04"},{"v":-0.06583724989991491,"d":"-0.07"},{"v":-0.041119815300080347,"d":"-0.04"},{"v":-0.15035842711886738,"d":"-0.15"},{"v":0.08970982550388494,"d":"0.09"},{"v":0.10732086810299572,"d":"0.11"}]
[{"$f":"AVERAGE(trust2!B65:'trust2'!G65)","v":{"v":0.8968113618272509,"d":"0.90"}},{"v":0.19756339921003027,"d":"0.20"},{"v":0.26935012892293864,"d":"0.27"},{"v":0.3172887122605833,"d":"0.32"},{"v":0.3081651369539092,"d":"0.31"},{"v":-0.3389423521463969,"d":"-0.34"},{"v":-0.5101698514040869,"d":"-0.51"}]
[{"$f":"AVERAGE(trust2!B66:'trust2'!G66)","v":{"v":0.7982455050915241,"d":"0.80"}},{"v":-0.040388039973801866,"d":"-0.04"},{"v":0.015389910125799927,"d":"0.02"},{"v":0.08485496865957669,"d":"0.08"},{"v":-0.010241135239739723,"d":"-0.01"},{"v":0.08286802235271432,"d":"0.08"},{"v":-0.12719826094147993,"d":"-0.13"}]
[{"$f":"AVERAGE(trust2!B67:'trust2'!G67)","v":{"v":0.9113840924423906,"d":"0.91"}},{"v":0.12956268608553698,"d":"0.13"},{"v":0.14200300954798004,"d":"0.14"},{"v":0.14098469516468054,"d":"0.14"},{"v":0.1781839497628919,"d":"0.18"},{"v":0.1202619799333308,"d":"0.12"},{"v":-0.5801521458894138,"d":"-0.58"}]
[{"$f":"AVERAGE(trust2!B68:'trust2'!G68)","v":{"v":0.766939901247158,"d":"0.77"}},{"v":0.10927897274261851,"d":"0.11"},{"v":-0.0731421095688947,"d":"-0.07"},{"v":0.039732399212543346,"d":"0.04"},{"v":0.16222702506043513,"d":"0.16"},{"v":-0.12419568950392089,"d":"-0.12"},{"v":-0.08508916268865371,"d":"-0.09"}]
[{"$f":"AVERAGE(trust2!B69:'trust2'!G69)","v":{"v":0.7292735411238361,"d":"0.73"}},{"v":0.0989467523655899,"d":"0.10"},{"v":0.03687051018891123,"d":"0.04"},{"v":-5.832915970481981E-4,"d":"-0.00"},{"v":0.056728949168925166,"d":"0.06"},{"v":0.07258875353225516,"d":"0.07"},{"v":-0.23958966435332338,"d":"-0.24"}]
[{"$f":"AVERAGE(trust2!B70:'trust2'!G70)","v":{"v":0.6992353095009983,"d":"0.70"}},{"v":0.05651890598534371,"d":"0.06"},{"v":-0.08093282705389096,"d":"-0.08"},{"v":0.016491663622699156,"d":"0.02"},{"v":0.11105557534363623,"d":"0.11"},{"v":-0.08645539666659736,"d":"-0.09"},{"v":-0.010542853802738691,"d":"-0.01"}]
[{"$f":"AVERAGE(trust2!B71:'trust2'!G71)","v":{"v":0.6174938807696696,"d":"0.62"}},{"v":0.009118636855727709,"d":"0.01"},{"v":-0.16600180921053856,"d":"-0.17"},{"v":-0.01747617549924747,"d":"-0.02"},{"v":-0.04562043461445771,"d":"-0.05"},{"v":0.05785523754161176,"d":"0.06"},{"v":0.14418402183035275,"d":"0.14"}]
[{"$f":"AVERAGE(trust2!B72:'trust2'!G72)","v":{"v":0.7157425937318408,"d":"0.72"}},{"v":0.0644972389761216,"d":"0.06"},{"v":-0.1927393801976585,"d":"-0.19"},{"v":0.03974997871291329,"d":"0.04"},{"v":0.014659914239953378,"d":"0.01"},{"v":0.08420566159409675,"d":"0.08"},{"v":-0.029940324132468204,"d":"-0.03"}]
[{"$f":"AVERAGE(trust2!B73:'trust2'!G73)","v":{"v":0.753900847715632,"d":"0.75"}},{"v":-0.026251882007887015,"d":"-0.03"},{"v":-0.053223515394052325,"d":"-0.05"},{"v":0.038853581101746706,"d":"0.04"},{"v":-0.026367811900656568,"d":"-0.03"},{"v":0.019232223372370585,"d":"0.02"},{"v":0.03475235152539746,"d":"0.03"}]
[{"$f":"AVERAGE(trust2!B74:'trust2'!G74)","v":{"v":0.8240033082684577,"d":"0.82"}},{"v":0.0915295416347143,"d":"0.09"},{"v":0.12913144801976967,"d":"0.13"},{"v":0.17747649305441232,"d":"0.18"},{"v":0.028833433292913865,"d":"0.03"},{"v":-0.17318445195577653,"d":"-0.17"},{"v":-0.17380633749117977,"d":"-0.17"}]
[{"$f":"AVERAGE(trust2!B75:'trust2'!G75)","v":{"v":0.7438061669171782,"d":"0.74"}},{"v":0.027324837485117593,"d":"0.03"},{"v":0.012430375715701955,"d":"0.01"},{"v":-0.021260409299262494,"d":"-0.02"},{"v":-0.018244946580063388,"d":"-0.02"},{"v":-0.020882067172741443,"d":"-0.02"},{"v":0.02271659278370786,"d":"0.02"}]
[{"$f":"AVERAGE(trust2!B76:'trust2'!G76)","v":{"v":0.823312279720298,"d":"0.82"}},{"v":0.16771283039842336,"d":"0.17"},{"v":0.14254937879253643,"d":"0.14"},{"v":0.19603280647621657,"d":"0.20"},{"v":0.15687546426682464,"d":"0.16"},{"v":-0.14037313996222528,"d":"-0.14"},{"v":-0.40340363817035263,"d":"-0.40"}]
[{"$f":"AVERAGE(trust2!B77:'trust2'!G77)","v":{"v":0.7553828935687351,"d":"0.76"}},{"v":0.11740965611629976,"d":"0.12"},{"v":0.15739446256772086,"d":"0.16"},{"v":0.07643709717249456,"d":"0.08"},{"v":-0.07137436080078834,"d":"-0.07"},{"v":-0.22866737899615805,"d":"-0.23"},{"v":-2.0069789377821006E-3,"d":"-0.00"}]
[{"$f":"AVERAGE(trust2!B78:'trust2'!G78)","v":{"v":0.7031203301821148,"d":"0.70"}},{"v":0.06297951679573276,"d":"0.06"},{"v":-0.0471741881682978,"d":"-0.05"},{"v":0.042552036627118615,"d":"0.04"},{"v":0.07626546862905798,"d":"0.08"},{"v":-0.13719888429383878,"d":"-0.14"},{"v":0.014099058663922298,"d":"0.01"}]
[{"$f":"AVERAGE(trust2!B79:'trust2'!G79)","v":{"v":0.6329648637370475,"d":"0.63"}},{"v":-0.5675958362898691,"d":"-0.57"},{"v":0.571825637388385,"d":"0.57"},{"v":0.032105188993785914,"d":"0.03"},{"v":-0.14479422277678147,"d":"-0.14"},{"v":-2.390538792781653E-3,"d":"-0.00"},{"v":0.12491381005239884,"d":"0.12"}]
[{"$f":"AVERAGE(trust2!B80:'trust2'!G80)","v":{"v":0.5941944894320145,"d":"0.59"}},{"v":-0.03385074237902621,"d":"-0.03"},{"v":-0.049648303883051144,"d":"-0.05"},{"v":-0.09780221977116309,"d":"-0.10"},{"v":-0.24024195423855102,"d":"-0.24"},{"v":0.11634670283431724,"d":"0.12"},{"v":0.2888143882538533,"d":"0.29"}]
[{"$f":"AVERAGE(trust2!B81:'trust2'!G81)","v":{"v":0.775809423321144,"d":"0.78"}},{"v":0.11691878791847063,"d":"0.12"},{"v":0.10687277595971215,"d":"0.11"},{"v":0.0847575552992997,"d":"0.08"},{"v":3.5537980426445424E-3,"d":"0.00"},{"v":-0.08457538168026832,"d":"-0.08"},{"v":-0.17554551252098932,"d":"-0.18"}]

{"sheet":"工作表1","index":15,"n_rows":17,"n_cols":23,"rows_kept":17}
["泡泡圖",{"$f":"COUNT(C2:C100)","v":16},"X ","Y ","Size","X ","Y ","No",{"$nulls":14},"工作表1"]
[null,1,0.01568928537504258,0.07,0.4279907721432807,0.01568928537504258,0.07,1]
[null,2,0.08847869860815706,-0.22,0.32152466914039923,0.08847869860815706,-0.22,2]
[null,3,3.6352712415512523E-3,0.24,0.5063614124037173,3.6352712415512523E-3,0.24,3]
[null,4,-0.033518387710077924,-0.17,0.337749922861184,-0.033518387710077924,-0.17,4]
[null,5,-0.06802008941851923,-0.16,0.34109346786171124,-0.06802008941851923,-0.16,5]
[null,6,0.053006677954100384,0.06,0.4237825708644433,0.053006677954100384,0.06,6]
[null,7,-0.08364430819888734,-0.42,0.26416037407436727,-0.08364430819888734,-0.42,7]
[null,8,-0.05923860151818558,0.27,0.5216282478399049,-0.05923860151818558,0.27,8]
[null,9,-0.06104268551948003,0.21,0.4915457839191627,-0.06104268551948003,0.21,9]
[null,10,-0.059535536243977255,0.26,0.5164883288590398,-0.059535536243977255,0.26,10]
[null,11,-0.06679133670371948,0.03,0.4114075415698816,-0.06679133670371948,0.03,11]
[null,12,-0.06092231963712956,-0.06,0.37643398972751063,-0.06092231963712956,-0.06,12]
[null,13,-0.056842185371950245,-0.82,0.1787430727237342,-0.056842185371950245,-0.82,13]
[null,14,-0.04376535847672751,0.21,0.4915457839191627,-0.04376535847672751,0.21,14]
[null,15,-0.05923860151818558,0.27,0.5216282478399049,-0.05923860151818558,0.27,15]
[null,16,-0.05529953746613898,0.25,0.5113995533407215,-0.05529953746613898,0.25,16]

{"sheet":"工作表2","index":17,"n_rows":17,"n_cols":23,"rows_kept":17}
["泡泡圖",{"$f":"COUNT(C2:C100)","v":16},"X ","Y ","Size","X ","Y ","No",{"$nulls":14},"工作表2"]
[null,1,-0.15420796121853647,0.07,0.4279907721432807,-0.15420796121853647,0.07,1]
[null,2,0.1533114232907662,-0.22,0.32152466914039923,0.1533114232907662,-0.22,2]
[null,3,3.6352712415512523E-3,0.24,0.5063614124037173,3.6352712415512523E-3,0.24,3]
[null,4,-0.033518387710077924,-0.17,0.337749922861184,-0.033518387710077924,-0.17,4]
[null,5,-0.06802008941851923,-0.16,0.34109346786171124,-0.06802008941851923,-0.16,5]
[null,6,0.053006677954100384,0.06,0.4237825708644433,0.053006677954100384,0.06,6]
[null,7,-0.08364430819888734,-0.42,0.26416037407436727,-0.08364430819888734,-0.42,7]
[null,8,-0.05923860151818558,0.27,0.5216282478399049,-0.05923860151818558,0.27,8]
[null,9,-0.06104268551948003,0.21,0.4915457839191627,-0.06104268551948003,0.21,9]
[null,10,-0.059535536243977255,0.26,0.5164883288590398,-0.059535536243977255,0.26,10]
[null,11,-0.06679133670371948,0.03,0.4114075415698816,-0.06679133670371948,0.03,11]
[null,12,-0.06092231963712956,-0.06,0.37643398972751063,-0.06092231963712956,-0.06,12]
[null,13,-0.056842185371950245,-0.82,0.1787430727237342,-0.056842185371950245,-0.82,13]
[null,14,-0.04376535847672751,0.21,0.4915457839191627,-0.04376535847672751,0.21,14]
[null,15,-0.05923860151818558,0.27,0.5216282478399049,-0.05923860151818558,0.27,15]
[null,16,-0.05529953746613898,0.25,0.5113995533407215,-0.05529953746613898,0.25,16]

{"sheet":"工作表3","index":19,"n_rows":17,"n_cols":23,"rows_kept":17}
["泡泡圖",{"$f":"COUNT(C2:C100)","v":16},"X ","Y ","Size","X ","Y ","No",{"$nulls":14},"工作表3"]
[null,1,-0.15420796121853647,0.07,0.4279907721432807,-0.15420796121853647,0.07,1]
[null,2,0.1533114232907662,-0.22,0.32152466914039923,0.1533114232907662,-0.22,2]
[null,3,3.6352712415512523E-3,0.24,0.5063614124037173,3.6352712415512523E-3,0.24,3]
[null,4,-0.033518387710077924,-0.17,0.337749922861184,-0.033518387710077924,-0.17,4]
[null,5,-0.06802008941851923,-0.16,0.34109346786171124,-0.06802008941851923,-0.16,5]
[null,6,0.053006677954100384,0.06,0.4237825708644433,0.053006677954100384,0.06,6]
[null,7,-0.08364430819888734,-0.42,0.26416037407436727,-0.08364430819888734,-0.42,7]
[null,8,-0.05923860151818558,0.27,0.5216282478399049,-0.05923860151818558,0.27,8]
[null,9,-0.06104268551948003,0.21,0.4915457839191627,-0.06104268551948003,0.21,9]
[null,10,-0.059535536243977255,0.26,0.5164883288590398,-0.059535536243977255,0.26,10]
[null,11,-0.06679133670371948,0.03,0.4114075415698816,-0.06679133670371948,0.03,11]
[null,12,-0.06092231963712956,-0.06,0.37643398972751063,-0.06092231963712956,-0.06,12]
[null,13,-0.056842185371950245,-0.82,0.1787430727237342,-0.056842185371950245,-0.82,13]
[null,14,-0.04376535847672751,0.21,0.4915457839191627,-0.04376535847672751,0.21,14]
[null,15,-0.05923860151818558,0.27,0.5216282478399049,-0.05923860151818558,0.27,15]
[null,16,-0.05529953746613898,0.25,0.5113995533407215,-0.05529953746613898,0.25,16]

{"sheet":"工作表4","index":21,"n_rows":17,"n_cols":23,"rows_kept":17}
["泡泡圖",{"$f":"COUNT(C2:C100)","v":16},"X ","Y ","Size","X ","Y ","No",{"$nulls":14},"工作表4"]
[null,1,-2.2893825469838087,0.07,0.4279907721432807,-2.2893825469838087,0.07,1]
[null,2,2.6846449050094177,-0.22,0.32152466914039923,2.6846449050094177,-0.22,2]
[null,3,3.6352712415512523E-3,0.24,0.5063614124037173,3.6352712415512523E-3,0.24,3]
[null,4,-0.033518387710077924,-0.17,0.337749922861184,-0.033518387710077924,-0.17,4]
[null,5,-0.06802008941851923,-0.16,0.34109346786171124,-0.06802008941851923,-0.16,5]
[null,6,0.053006677954100384,0.06,0.4237825708644433,0.053006677954100384,0.06,6]
[null,7,-0.08364430819888734,-0.42,0.26416037407436727,-0.08364430819888734,-0.42,7]
[null,8,-0.05923860151818558,0.27,0.5216282478399049,-0.05923860151818558,0.27,8]
[null,9,-0.06104268551948003,0.21,0.4915457839191627,-0.06104268551948003,0.21,9]
[null,10,-0.059535536243977255,0.26,0.5164883288590398,-0.059535536243977255,0.26,10]
[null,11,-0.06679133670371948,0.03,0.4114075415698816,-0.06679133670371948,0.03,11]
[null,12,-0.06092231963712956,-0.06,0.37643398972751063,-0.06092231963712956,-0.06,12]
[null,13,-0.056842185371950245,-0.82,0.1787430727237342,-0.056842185371950245,-0.82,13]
[null,14,-0.04376535847672751,0.21,0.4915457839191627,-0.04376535847672751,0.21,14]
[null,15,-0.05923860151818558,0.27,0.5216282478399049,-0.05923860151818558,0.27,15]
[null,16,-0.05529953746613898,0.25,0.5113995533407215,-0.05529953746613898,0.25,16]

{"sheet":"bubble","index":22,"n_rows":17,"n_cols":8,"rows_kept":17}
["泡泡圖",{"$f":"COUNT(C2:C100)","v":16},"X ","Y ","Size","X ","Y ","No"]
[null,1,-2.2893825469838087,0.07,0.4279907721432807,-2.2893825469838087,0.07,1]
[null,2,2.6846449050094177,-0.22,0.32152466914039923,2.6846449050094177,-0.22,2]
[null,3,3.6352712415512523E-3,0.24,0.5063614124037173,3.6352712415512523E-3,0.24,3]
[null,4,-0.033518387710077924,-0.17,0.337749922861184,-0.033518387710077924,-0.17,4]
[null,5,-0.06802008941851923,-0.16,0.34109346786171124,-0.06802008941851923,-0.16,5]
[null,6,0.053006677954100384,0.06,0.4237825708644433,0.053006677954100384,0.06,6]
[null,7,-0.08364430819888734,-0.42,0.26416037407436727,-0.08364430819888734,-0.42,7]
[null,8,-0.05923860151818558,0.27,0.5216282478399049,-0.05923860151818558,0.27,8]
[null,9,-0.06104268551948003,0.21,0.4915457839191627,-0.06104268551948003,0.21,9]
[null,10,-0.059535536243977255,0.26,0.5164883288590398,-0.059535536243977255,0.26,10]
[null,11,-0.06679133670371948,0.03,0.4114075415698816,-0.06679133670371948,0.03,11]
[null,12,-0.06092231963712956,-0.06,0.37643398972751063,-0.06092231963712956,-0.06,12]
[null,13,-0.056842185371950245,-0.82,0.1787430727237342,-0.056842185371950245,-0.82,13]
[null,14,-0.04376535847672751,0.21,0.4915457839191627,-0.04376535847672751,0.21,14]
[null,15,-0.05923860151818558,0.27,0.5216282478399049,-0.05923860151818558,0.27,15]
[null,16,-0.05529953746613898,0.25,0.5113995533407215,-0.05529953746613898,0.25,16]

{"sheet":"ANOVA2","index":23,"n_rows":3,"n_cols":26,"rows_kept":3}
[{"$f":"COUNT(B2:B4000)+2","v":4},{"$nulls":22},"B23","B24","B25"]
[null,-0.26,0.09,{"$nulls":20},20.83,66.67,66.67]
[null,-0.47,0.47,{"$nulls":20},24.66,62.33,46.58]

{"sheet":"TableA","index":24,"n_rows":116,"n_cols":39,"rows_kept":116}
["Error of .05",2,3,4,5,6,7,8,9,10,11,12,13,14,15," ",null,null,"Nomal Residual Test",null,null,0.1,0.05,0.025,0.01,0.005,"固定效果模式","v2","v1","v2v1",1,1.5,2,2.5,3,3.5,4,4.5,5]
[1,17.97,26.98,32.82,37.08,40.41,43.12,45.4,47.36,49.07,50.59,51.96,53.2,54.33,55.36,{"$nulls":3},"(本書附表H)",null,5,0.903,0.88,0.865,0.826,0.807,"alpha=.05",1,2,12,8,11,14,18,21,24,27,31,34]
[2,6.08,8.33,9.8,1088,11.74,12.44,13.03,13.54,13.99,14.39,14.75,15.08,15.38,15.65,{"$nulls":5},6,0.91,0.888,0.866,0.838,0.82,"(本書附表2)",2,2,22,12,20,30,41,52,62,71,79,85]
[3,4.5,5.91,6.82,7.5,8.04,8.48,8.85,9.18,9.46,9.72,9.95,10.15,10.35,10.53,{"$nulls":5},7,0.918,0.898,0.877,0.85,0.828,null,3,2,32,15,28,44,60,75,86,93,97,99]
[4,3.39,5.04,5.76,6.29,6.71,7.05,7.35,7.6,7.33,8.03,8.21,8.37,8.52,8.66,{"$nulls":5},8,0.924,0.906,0.887,0.861,0.84,null,4,2,42,18,34,54,73,86,94,98,99,100]
[5,3.64,1.6,5.22,5.67,6.03,6.33,6.58,6.8,7,7.17,7.32,7.47,7.6,7.72,{"$nulls":5},9,0.93,0.912,0.894,0.871,0.854,null,5,2,52,20,39,61,80,92,97,99,100,100]
[6,3.46,4.34,4.9,5.31,5.63,5.9,6.12,6.32,6.49,6.65,6.79,6.92,7.03,7.14,{"$nulls":5},10,0.934,0.918,0.901,0.879,0.862,null,6,2,62,21,42,66,85,95,99,100,100,100]
[7,3.34,4.16,4.68,5.06,5.36,5.61,5.82,6,6.16,6.3,6.43,6.55,6.66,6.76,{"$nulls":5},12,0.942,0.928,0.912,0.892,0.876,null,7,2,72,22,45,70,88,96,99,100,100,100]
[8,3.26,4.04,4.53,4.89,5.17,5.4,5.6,5.77,5.92,6.05,6.18,6.29,6.39,6.48,{"$nulls":5},14,0.948,0.935,0.923,0.905,0.89,null,8,2,82,23,47,72,90,97,100,100,100,100]
[9,3.2,3.95,4.42,4.76,5.02,5.24,5.43,5.6,5.74,5.87,5.98,6.09,6.19,6.28,{"$nulls":5},16,0.953,0.941,0.929,0.913,0.899,null,9,2,92,24,49,74,91,98,100,100,100,100]
[10,3.15,3.88,4.33,4.65,4.91,5.12,5.3,5.46,5.6,5.72,5.83,5.94,6.03,6.11,{"$nulls":5},18,0.957,0.946,0.935,0.92,0.908,null,10,2,102,25,50,76,92,98,100,100,100,100]
[11,3.11,3.82,4.26,4.57,4.82,5.03,5.2,5.35,5.49,5.6,5.71,5.81,5.9,5.98,{"$nulls":5},20,0.96,0.951,0.94,0.926,0.916,null,12,2,122,26,53,78,93,99,100,100,100,100]
[12,3.08,3.77,4.2,4.51,4.75,4.95,5.12,5.26,5.4,5.51,5.62,5.71,5.79,5.88,{"$nulls":5},22,0.963,0.954,0.945,0.933,0.923,null,14,2,142,27,54,80,94,99,100,100,100,100]
[13,3.06,3.74,4.15,4.45,4.69,4.88,5.05,5.19,5.32,5.43,5.53,5.63,5.71,5.79,{"$nulls":5},24,0.965,0.957,0.949,0.937,0.927,null,16,2,162,27,55,81,95,99,100,100,100,100]
[14,3.03,3.7,4.11,4.41,4.64,4.83,4.99,5.13,5.25,5.36,5.46,5.55,5.64,5.71,{"$nulls":5},26,0.967,0.96,0.952,0.941,0.932,null,18,2,182,28,56,82,95,99,100,100,100,100]
[15,3.01,3.67,4.08,4.37,4.6,4.78,4.94,5.08,5.2,5.31,5.4,5.49,5.57,5.65,{"$nulls":5},28,0.969,0.962,0.955,0.944,0.936,null,20,2,202,28,57,83,96,99,100,100,100,100]
[16,3,3.65,4.05,4.33,4.56,4.74,4.9,5.03,5.15,5.26,5.35,5.44,5.52,5.59,{"$nulls":5},30,0.971,0.964,0.957,0.947,0.939,null,22,2,222,29,58,83,96,99,100,100,100,100]
[17,2.98,3.63,4.02,4.3,4.52,4.7,4.86,4.99,5.11,5.21,5.31,5.39,5.47,5.54,{"$nulls":5},40,0.977,0.972,0.966,0.959,0.953,null,24,2,242,29,58,84,96,99,100,100,100,100]
[18,2.97,3.61,4,4.28,4.5,4.67,4.82,4.96,5.07,5.17,5.27,5.35,5.43,5.5,{"$nulls":5},50,0.981,0.977,0.972,0.966,0.961,null,26,2,262,29,59,84,96,99,100,100,100,100]
[19,2.96,3.59,3.98,4.25,4.47,4.64,4.79,4.92,5.04,5.14,5.23,5.32,5.39,5.46,{"$nulls":5},60,0.984,0.98,0.976,0.971,0.967,null,28,2,282,29,59,85,96,100,100,100,100,100]
[20,2.95,3.58,3.96,4.23,4.44,4.62,4.77,4.9,5.01,5.11,5.2,5.28,5.36,5.43,{"$nulls":5},70,0.986,0.983,0.979,0.975,0.971,null,30,2,302,29,60,85,97,100,100,100,100,100]
[24,2.92,3.53,3.9,4.17,4.37,4.54,4.68,4.81,1.92,5.01,5.1,5.18,5.25,5.32,{"$nulls":5},80,0.987,0.985,0.982,0.978,0.975,null,60,2,602,31,62,87,97,100,100,100,100,100]
[30,2.89,3.49,3.84,4.1,4.3,4.46,4.6,4.72,4.82,4.92,5,5.08,5.15,5.21,{"$nulls":5},90,0.988,0.986,0.984,0.98,0.977,null,120,2,1202,31,63,88,98,100,100,100,100,100]
[40,2.86,3.44,3.79,4.04,4.23,4.39,4.52,4.64,4.74,4.82,4.9,4.98,5.04,5.11,{"$nulls":5},100,0.989,0.987,0.985,0.985,0.979,null,300,2,3002,32,64,88,98,100,100,100,100,100]
[60,2.83,3.4,3.74,3.98,4.16,4.31,4.44,4.55,4.65,4.73,4.81,4.88,4.94,5,{"$nulls":12},1,3,13,8,10,13,16,19,22,25,28,31]
[102,2.8,3.36,3.69,3.92,4.1,4.24,4.36,4.47,4.56,4.64,4.71,4.78,4.84,4.9,{"$nulls":12},2,3,23,11,18,27,38,48,58,68,76,82]
["others",2.77,3.31,3.63,3.86,4.03,4.17,4.29,4.39,4.47,4.55,4.62,4.68,4.74,4.8,{"$nulls":12},3,3,33,14,26,42,58,73,84,92,96,98]
[{"$nulls":27},4,3,43,17,33,53,72,86,94,98,99,100]
[null,null," ",{"$nulls":24},5,3,53,19,38,61,81,93,98,99,100,100]
[{"$nulls":27},6,3,63,21,43,67,86,96,99,100,100,100]
[{"$nulls":27},7,3,73,22,46,72,89,97,100,100,100,100]
[{"$nulls":27},8,3,83,24,49,75,92,98,100,100,100,100]
[{"$nulls":27},9,3,93,25,51,77,93,99,100,100,100,100]
[{"$nulls":27},10,3,103,25,53,79,94,99,100,100,100,100]
[{"$nulls":27},12,3,123,27,56,82,96,99,100,100,100,100]
[{"$nulls":27},14,3,143,28,58,84,97,100,100,100,100,100]
[{"$nulls":27},16,3,163,29,60,86,97,100,100,100,100,100]
[{"$nulls":27},18,3,183,29,61,87,97,100,100,100,100,100]
[{"$nulls":27},20,3,203,30,62,87,98,100,100,100,100,100]
[{"$nulls":27},22,3,223,31,63,88,98,100,100,100,100,100]
[{"$nulls":27},24,3,243,31,63,89,98,100,100,100,100,100]
[{"$nulls":27},26,3,263,31,64,89,98,100,100,100,100,100]
[{"$nulls":27},28,3,283,32,65,89,98,100,100,100,100,100]
[{"$nulls":27},30,3,303,32,65,90,98,100,100,100,100,100]
[{"$nulls":27},60,3,603,34,68,92,99,100,100,100,100,100]
[{"$nulls":27},120,3,1203,35,70,93,99,100,100,100,100,100]
[{"$nulls":27},300,3,3003,36,71,93,99,100,100,100,100,100]
[{"$nulls":27},1,4,14,8,10,13,15,18,21,24,27,29]
[{"$nulls":27},2,4,24,11,18,26,36,46,56,66,74,80]
[{"$nulls":27},3,4,34,14,26,41,57,72,83,91,96,98]
[{"$nulls":27},4,4,44,17,33,53,72,86,94,98,99,100]
[{"$nulls":27},5,4,54,19,39,62,81,93,98,100,100,100]
[{"$nulls":27},6,4,64,21,43,69,87,96,99,100,100,100]
[{"$nulls":27},7,4,74,23,47,73,91,98,100,100,100,100]
[{"$nulls":27},8,4,84,24,50,77,93,99,100,100,100,100]
[{"$nulls":27},9,4,94,25,53,80,98,99,100,100,100,100]
[{"$nulls":27},10,4,104,26,55,82,96,99,100,100,100,100]
[{"$nulls":27},12,4,124,28,59,85,97,100,100,100,100,100]
[{"$nulls":27},14,4,144,29,61,87,98,100,100,100,100,100]
[{"$nulls":27},16,4,164,30,63,89,98,100,100,100,100,100]
[{"$nulls":27},18,4,184,31,65,90,99,100,100,100,100,100]
[{"$nulls":27},20,4,204,32,66,91,99,100,100,100,100,100]
[{"$nulls":27},22,4,224,33,67,91,99,100,100,100,100,100]
[{"$nulls":27},24,4,244,33,68,92,99,100,100,100,100,100]
[{"$nulls":27},26,4,264,33,69,92,99,100,100,100,100,100]
[{"$nulls":27},28,4,284,34,69,93,99,100,100,100,100,100]
[{"$nulls":27},30,4,304,34,70,93,99,100,100,100,100,100]
[{"$nulls":27},60,4,604,37,74,93,100,100,100,100,100,100]
[{"$nulls":27},120,4,1204,38,76,96,100,100,100,100,100,100]
[{"$nulls":27},300,4,3004,39,77,96,100,100,100,100,100,100]
[{"$nulls":27},1,5,15,8,10,12,15,18,20,23,26,29]
[{"$nulls":27},2,5,25,11,17,26,35,45,55,64,72,79]
[{"$nulls":27},3,5,35,14,25,40,56,71,83,91,95,98]
[{"$nulls":27},4,5,45,17,32,53,72,86,94,98,99,100]
[{"$nulls":27},5,5,55,19,39,62,82,93,98,100,100,100]
[{"$nulls":27},6,5,65,21,44,70,88,97,99,100,100,100]
[{"$nulls":27},7,5,75,23,48,75,92,98,100,100,100,100]
[{"$nulls":27},8,5,85,24,52,79,94,99,100,100,100,100]
[{"$nulls":27},9,5,95,26,55,82,96,99,100,100,100,100]
[{"$nulls":27},10,5,105,27,57,84,97,100,100,100,100,100]
[{"$nulls":27},12,5,125,29,61,88,98,100,100,100,100,100]
[{"$nulls":27},14,5,145,30,64,90,99,100,100,100,100,100]
[{"$nulls":27},16,5,165,32,66,91,99,100,100,100,100,100]
[{"$nulls":27},18,5,185,33,68,92,99,100,100,100,100,100]
[{"$nulls":27},20,5,205,34,70,93,99,100,100,100,100,100]
[{"$nulls":27},22,5,225,34,71,94,100,100,100,100,100,100]
[{"$nulls":27},24,5,245,35,72,94,100,100,100,100,100,100]
[{"$nulls":27},26,5,265,36,73,95,100,100,100,100,100,100]
[{"$nulls":27},28,5,285,36,73,95,100,100,100,100,100,100]
[{"$nulls":27},30,5,305,36,74,95,100,100,100,100,100,100]
[{"$nulls":27},60,5,605,40,78,97,100,100,100,100,100,100]
[{"$nulls":27},120,5,1205,41,80,97,100,100,100,100,100,100]
[{"$nulls":27},300,5,3005,43,82,98,100,100,100,100,100,100]
[{"$nulls":27},1,6,16,7,10,12,18,17,20,23,25,28]
[{"$nulls":27},2,6,26,10,17,25,34,44,54,63,71,78]
[{"$nulls":27},3,6,36,14,25,40,56,71,82,90,95,98]
[{"$nulls":27},4,6,46,16,32,53,72,86,94,98,99,100]
[{"$nulls":27},5,6,56,19,39,63,82,94,98,100,100,100]
[{"$nulls":27},6,6,66,21,44,70,89,97,99,100,100,100]
[{"$nulls":27},7,6,76,23,49,76,93,98,100,100,100,100]
[{"$nulls":27},8,6,86,25,53,80,95,100,100,100,100,100]
[{"$nulls":27},9,6,96,26,56,83,96,100,100,100,100,100]
[{"$nulls":27},10,6,106,28,59,86,97,100,100,100,100,100]
[{"$nulls":27},12,6,126,30,63,89,98,100,100,100,100,100]
[{"$nulls":27},14,6,146,32,66,91,99,100,100,100,100,100]
[{"$nulls":27},16,6,166,33,69,93,99,100,100,100,100,100]
[{"$nulls":27},18,6,186,34,71,94,99,100,100,100,100,100]
[{"$nulls":27},20,6,206,35,73,95,100,100,100,100,100,100]
[{"$nulls":27},22,6,226,36,74,95,100,100,100,100,100,100]
[{"$nulls":27},24,6,246,37,75,96,100,100,100,100,100,100]
[{"$nulls":27},26,6,266,37,76,96,100,100,100,100,100,100]
[{"$nulls":27},28,6,286,38,77,96,100,100,100,100,100,100]
[{"$nulls":27},30,6,306,39,77,97,100,100,100,100,100,100]
[{"$nulls":27},60,6,606,42,82,98,100,100,100,100,100,100]
[{"$nulls":27},120,6,1206,45,84,99,100,100,100,100,100,100]
[{"$nulls":27},300,6,3006,47,86,99,100,100,100,100,100,100]

{"sheet":"ICC","index":25,"n_rows":0,"n_cols":0,"rows_kept":0}

{"sheet":"SST","index":26,"n_rows":81,"n_cols":12,"rows_kept":81}
[{"$f":"AVERAGE(trust!B2:G81)/100","v":0.7261777694998297},{"$f":"residual!B3","v":-0.020988669553264505},{"$f":"residual!C3","v":0.0314121165354696},{"$f":"SUM(A2:A76)","v":0},{"$f":"residual!E3","v":-0.026673100857435794},{"$f":"AVERAGE(trust!B2:Z76)/100","v":0.7284358885367114},{"$f":"SUM(A2:A76)","v":0},{"$f":"residual!H3","v":0},"TSE","SST","Regress"," "]
[null,-4.3371101591704875E-3,0.14978376896170864,-0.014639307961368142,0.02141838434632415,0.007796589474529103,-0.022881066203126355]
[null,0.08409008764302739,0.16132223050017025,0.0785097305001703,0.0667909805001703,0.013405563833503553,-0.011892055214115405]
[null,-0.0208206266426868,0.0863222305001703,-0.07305276949982975,-0.11992776949982975,-0.12201110283316297,-0.0208206266426868]
[null,-0.14326960623452356,0.07560794478588473,-0.2886777694998297,-0.0877849123569725,-0.15772538854744877,-0.07056552460187049]
[null,-0.07617776949982968,0.09132223050017041,-0.15742776949982973,-0.10742776949982968,-0.0928444361664964,-0.02439205521411536]
[null,-0.07821858582636043,0.005140911818851568,-0.10220798928004948,-0.1078741980712582,-0.08698363030569056,-0.05938028127377015]
[null,-0.011636953173298936,0.16132223050017025,-0.027517055214115516,0.036768659071598875,-0.02796348378554403,0.01208753662261941]
[null,-0.110744096030442,0.06221508764302741,-0.0961554480712582,-0.0861108052141154,-0.10861824569030598,-0.02273389194880926]
[null,-0.07206286266753159,0.1140396218045181,-0.14397668254330798,-0.09913972602156873,0.02472802760161963,2.4712988231517796E-3]
[null,0.12025080192874171,0.11382223050017026,0.08007223050017032,0.03632223050017025,-0.0747888806109408,-0.038677769499829706]
[null,-0.0208206266426868,0.0863222305001703,-0.1011777694998297,-0.1011777694998297,-0.33034443616649634,-0.127963483785544]
[null,-0.031850038407392756,0.11941046579428816,-0.054302769499829706,-0.03224394597041802,-0.08156992636257476,-0.03657692916369526]
[null,-0.1011777694998297,0.14960348050017025,-0.1041074569998297,-0.0718808944998297,-0.04909443616649645,0.010987409071598897]
[null,0.06097882390676357,0.05805299973093947,0.03656261511555481,0.05531261511555485,-0.09685084642290676,-0.08716678048884063]
[null,0.09145140983147715,0.04722648581931921,0.06637542198953206,0.07834350709591498,-0.14461748581188638,-0.15018992755454097]
[null,0.038573783295201336,0.012952665282779052,0.03333310006538759,0.057789621804518077,-0.210779218775192,-0.14426783161163093]
[null,0.15092307083630474,0.13043987755899378,0.10010899520605243,0.08356487755899378,-0.17593267146061398,-0.11063155101243471]
[null,0.14499569988792538,0.15685794478588444,0.1499383019287417,0.1454740162144561,-0.08381665838871855,-0.10691756541819697]
[null,0.07469824128184155,0.007076947481302387,0.03679392861337771,0.032371758802057116,-0.14598909025454676,-0.13655512799039582]
[null,0.10260374310521236,0.02455752461781724,0.048638406970758385,0.05782958344134681,-0.1808346322449278,-0.1684046602561322]
[null,0.15206898374692357,0.14257223050017032,0.13674836686380665,0.1566347305001703,-0.12863989071195114,-0.10767127599333626]
[null,0.08961893379687369,0.10593761511555466,0.0856010766540164,0.09353376896170873,-0.11399828232034259,-0.10735908818114837]
[null,0.10538593706387667,0.08868709536503516,0.07956547374341372,0.09561277104071075,-0.10605764937970963,-0.0543630976851579]
[null,0.10664242754450526,0.1037791270518944,0.08874679946568742,0.097636885672584,-0.13530133271822065,-0.1455127448692879]
[null,0.06443634199842818,0.04333442562212153,0.06345637684163374,0.0777475353782191,-0.14690947681690292,-0.08811156740923742]
[null,-0.13347818966789693,-0.014045416558653212,-0.09152703420571218,-0.09290571067630027,-0.11527090675473173,0.012267608651430728]
[null,0.0785097305001703,0.033197230500170316,0.053119105500170294,0.006244105500170294,-0.18885138061094076,-0.08443669807125831]
[null,0.0867880690094871,0.06903962180451806,0.08469179571756169,0.09692005658712688,-0.14809805935490206,-0.0727616204315068]
[null,0.1265008019287417,0.08163473050017034,0.1429628555001703,0.1664003555001703,-0.12982360283316297,-0.09671348378554401]
[null,0.09971508764302739,0.02325404868198855,0.07353813959107935,0.09058359413653394,-0.11632928465134484,-0.08413231495437501]
[null,0.010250801928741726,0.009822230500170281,-1.802769499829715E-3,0.01882223050017029,-0.16784443616649647,-0.09796348378554398]
[null,0.12771833439627422,0.171549503227443,0.15024268504562488,0.15024268504562488,-0.0557232240452844,-0.0743920552141154]
[null,0.10884658114952095,0.15620859413653387,0.13106654868198842,0.1449159805001703,-0.04625352707558705,-0.04030114612320623]
[null,0.09812610459217985,0.08950019660186526,0.09585612880525518,0.09665062033067884,-0.15520319322864318,-0.09618382276859483]
[null,0.12886424730689305,0.15029281873546452,0.10286634814722917,0.11665311285311142,-0.12201110283316297,-0.06021138294520767]
[null,0.0662329447858846,0.05819723050017034,0.0628847305001703,0.033587855500170294,-0.1011777694998297,-0.1078741980712582]
[null,-0.13332062664268673,0.09382223050017013,-0.2418027694998297,-0.18555276949982968,-0.07617776949982968,-0.03689205521411543]
[null,-0.27974919807125825,-0.08867776949982975,-0.2886777694998297,-0.038677769499829706,-0.10812221394427413,0.005965087643027389]
[null,-0.11791884092840121,0.025384730500170316,-0.1832090194998297,-0.1187558944998297,-0.09076110283316297,-0.0676956266426868]
[null,0.084594119901092,0.07664481114533161,0.05154400469371878,0.05910448856468642,-0.06959174799445333,-0.08562477410812463]
[null,0.08718628579970933,0.0845077143711378,0.08707827888726705,0.08027384340339616,-0.027925081327786705,-0.061863253370797566]
[null,3.601642264876137E-3,-0.029486593029241615,-0.0384479900880651,-0.0322439459704178,-0.13487874989198645,-0.12244877790319109]
[null,0.02235164226487607,0.01661634814722912,-0.014045416558653212,-0.023420416558653234,-0.1097562008723787,-0.1330055005922668]
[null,0.05953651621445599,0.05632223050017027,-0.03555276949982966,0.006634730500170272,-0.15742776949982973,-0.15742776949982973]
[null,0.1532865162144561,0.05632223050017027,0.10038473050017027,0.11444723050017025,-0.06576110283316294,0.000607944785884551]
[null,0.005965087643027389,0.02574530742324721,-0.050697000269060544,-0.03627392334598356,-0.08354956437162464,-0.04348546180752211]
[null,0.040403863153231634,0.027393659071598853,0.0729293733573132,0.04614365907159901,-0.023796817118877267,-0.036126749091666466]
[null,0.09167937335731324,0.009447230500170267,0.07694723050017027,0.060540980500170316,-0.09596943616649645,-0.05564205521411536]
[null,0.05693234954778925,0.048822230500170316,0.021869105500170294,0.043353480500170294,-0.07947638061094087,-0.09671348378554401]
[null,0.1398936590715989,0.011322230500170338,0.1331972305001703,0.1331972305001703,-0.1011777694998297,-0.1011777694998297]
[null,-0.054302769499829706,-0.044927769499829684,-0.007427769499829706,-1.5683944998297061E-3,-0.1402402694998297,-0.16479384092840121]
[null,0.1488222305001703,0.11132223050017032,0.055072230500170294,0.1175722305001703,-0.1011777694998297,-0.1368920552141154]
[null,0.0461436590715989,-0.054302769499829706,-0.030865269499829706,0.039447230500170294,-0.09596943616649645,-0.04090991235697261]
[null,0.005965087643027389,-0.05117776949982966,-0.0855527694998297,-0.0855527694998297,-0.14978888061094076,-0.2083206266426868]
[null,-0.000731340928401103,-0.06367776949982973,0.051165980500170294,0.004290980500170294,-0.18971943616649645,-0.08778491235697261]
[null,0.1934650876430274,0.16132223050017025,0.1800722305001703,0.1331972305001703,-0.059511102833162965,-0.1011777694998297]
[null,0.06221508764302741,0.0750722305001702,0.04647848050017034,0.025384730500170316,-0.07826110283316301,-0.07573134092840106]
[null,0.1228482045261442,0.16132223050017025,0.12893586686380665,0.15024268504562488,0.00488283656077626,-0.17422971755177774]
[null,0.03275080192874169,0.2738222305001703,0.0863222305001703,-0.1949277694998297,0.10715556383350378,0.005965087643027389]
[null,0.1800722305001703,0.1885949577728976,0.17581086686380665,0.1864642759547157,0.11473132140926123,-0.05491153573359586]
[null,0.1309650876430274,0.1488222305001703,0.1175722305001703,0.1019472305001703,0.016877786055725874,-0.127963483785544]
[null,-0.2083206266426868,-0.21367776949982975,-0.5230527694998297,-0.1949277694998297,-0.12201110283316297,-0.1815349123569726]
[null,0.028924271316496997,0.019357944785884595,-0.0342134837855439,-0.07104384092840121,-0.09820157902363935,-0.07630532052023786]
[null,0.2470365162144561,0.2738222305001703,0.2738222305001703,0.2738222305001703,2.9888971668370345E-3,-0.0476063409284011]
[null,0.09596508764302736,0.14032223050017023,0.12382223050017027,0.09569723050017032,0.029655563833503762,-0.05296348378554405]
[null,0.23780006301248546,0.24925326498292877,0.23341274774154952,0.2463437822243082,0.18474177073005504,-0.0402171783668247]
[null,0.1265008019287417,0.08397848050017032,0.0775331680001703,0.1361269180001703,-0.1050840194998297,-0.0743920552141154]
[null,0.09134455192874169,0.09569723050017032,0.024798793000170294,0.059955043000170294,-0.058209019499829706,-0.1949277694998297]
[null,0.04736119153913121,0.023254048681988437,3.2256395910793545E-3,0.05649268504562488,-0.17125352707558716,-0.12065828898034925]
[null,-0.04939205521411538,-0.08867776949982975,-0.0933652694998297,-0.0933652694998297,-0.19214999172205194,-0.13510634092840113]
[null,0.06527631213282348,-0.007427769499829706,0.0294025876430275,0.02940258764302739,-0.06843967426173436,-0.110744096030442]
[null,0.061565736993676845,0.08064041231835217,0.06501541231835217,0.047969957772897476,-0.05414494121700142,-0.03461932794138822]
[null,0.16476610805119074,0.19614365907159892,0.1800722305001703,0.1331972305001703,-0.04909443616649645,-0.038040014397789035]
[null,0.07426865907159885,0.09757223050017039,0.03007223050017027,0.04179098050017027,-0.0855527694998297,-0.05229384092840106]
[null,0.19078651621445608,0.2000722305001702,0.18632223050017027,0.17850973050017027,-0.03589999172205194,-0.1368920552141154]
[null,0.12041313959107935,0.16132223050017025,0.08206086686380665,0.030924503227443,-0.16935958768164794,-0.05004140586346606]
[null,0.05358413526207495,0.0404888971668369,0.018613897166836813,0.04465556383350355,-0.19145554727760739,-0.10415395997602006]
[null,-0.3020706266426868,0.25507223050017025,-0.054302769499829706,-0.1246152694998297,-0.20534443616649645,-0.127963483785544]
[null,-0.0922491980712582,-0.05742776949982975,-0.1558652694998297,-0.2105527694998297,-0.1879833250553853,-0.08778491235697261]
[null,0.13654544478588448,0.1566347305001703,0.1039003555001703,0.0804628555001703,-0.07513610283316297,-0.10452598378554401]

{"sheet":"output_w","index":27,"n_rows":24,"n_cols":85,"rows_kept":24}
[]
[null,null,"<Person                                                                 Item:Infit MNSQ   .5                       1.0                         1.5                         2.0                         2.5"]
[{"$nulls":84},"Sig."]
[3.3,{"$nulls":81},0,0]
[3.1,{"$nulls":81},0,0]
[2.9,{"$nulls":81},0,0]
[2.7,{"$nulls":81},0,0]
[2.5,{"$nulls":81},0,0]
[2.3,{"$nulls":81},1,0]
[2.1,{"$nulls":81},1,0]
[1.9,{"$nulls":81},0,0]
[1.7,{"$nulls":81},1,0]
[1.5,{"$nulls":81},2,0]
[1.3,{"$nulls":81},10,0]
[1.1,{"$nulls":81},21,0]
[0.9,{"$nulls":81},14,0]
[0.7,{"$nulls":81},17,0]
[0.5,{"$nulls":81},8,0]
[0.3,{"$nulls":46},5,6,{"$nulls":33},4,2]
[0.1,{"$nulls":81},0,0]
[-0.1,{"$nulls":46},3,{"$nulls":34},1,1]
[-0.3,{"$nulls":46},4,1,{"$nulls":33},0,2]
[-0.5,{"$nulls":46},2,{"$nulls":34},0,1]
[{"$nulls":28}," Each # eqauls to 1 case ( * stands for Infit MNSQ > 2.5)",{"$nulls":53},{"$f":"SUM(CE4:CE23)","v":80},{"$f":"SUM(CF4:CF23)","v":6}]