{"text_format":"3","workbook":"xlsx","n_sheets":7,"sheets":["rapport","Estimates_Male","Estimates_Female","BFA_MaleCDC","BFA_MaleWHO","BFA_FemaleCDC","BFA_FemaleWHO"],"not_rendered":{"defined_names":9},"read":"whole","date_system":"1900"}

{"sheet":"rapport","index":0,"n_rows":38,"n_cols":17,"rows_kept":38,"merged":[[0,0,0,17],[2,2,2,5],[2,7,2,8],[2,10,2,13],[2,15,2,17],[3,2,3,5],[3,7,3,9],[4,7,4,8],[4,10,4,14],[4,15,4,17],[7,10,7,17],[8,0,8,2],[8,7,8,9],[8,10,8,17],[9,10,9,17],[10,1,10,9],[10,10,10,12],[10,13,10,17],[12,6,12,8],[12,9,12,11],[12,12,12,17],[13,8,13,9],[14,3,14,4],[14,8,14,9],[15,8,15,9],[17,8,17,9],[20,3,20,4],[20,8,20,9],[21,8,21,9],[22,8,22,9],[24,3,24,4],[24,8,24,9],[25,3,25,5],[25,8,25,9],[26,3,26,4],[26,8,26,9],[27,13,27,14],[27,15,27,16],[28,8,28,9],[29,3,29,4],[29,8,29,9],[30,3,30,4],[30,8,30,9],[31,0,31,1],[31,3,31,5],[31,8,31,9],[32,3,32,4],[32,8,32,9],[33,8,33,9],[34,3,34,5],[34,8,34,9],[35,3,35,5],[35,8,35,9],[36,0,36,5],[37,0,37,5]]}
["Z score calculator for cardiopulmonary exercise testing in children"]
[]
["Last name :",{"$nulls":6},"Birth date :",null,null,"1992-07-21",{"$nulls":4},"(yyyy-mm-dd)"]
["First name :",{"$nulls":6},"Medical chart number :"]
["Height :",null,null,155,"cm",null,null,"Date of test:",null,null,"2007-07-21",{"$nulls":4},"(yyyy-mm-dd)"]
["Body mass :",null,null,{"v":55,"d":"55.0"},"kg",null,null,"Age:",null,null,{"$f":"ROUND((K5-K3)/365,1)","v":{"v":15,"d":"15.0"}},"years"]
["BMI:",null,null,{"$f":"D6/((D5/100)*(D5/100))","v":{"v":22.892819979188342,"d":"22.9"}},"kg/m2",null,null,"Sex:",null,null,"M","(M or F)"]
["*BMI Z score :",null,null,{"$f":"IF(AND($K$6>=12, $K$6<=18), BFA_MaleWHO!$J$6, \"outside age range\")","v":{"v":1.059494693022724,"d":"1.1"}},"(ajusted for sex and age)",null,null,"Operator:"]
["**Corrected body mass: ",null,null,{"$f":"IF(AND(D8>=1,$K$7=\"M\"),BFA_MaleWHO!K16,IF(AND(D8>=1,$K$7=\"F\"),BFA_MaleWHO!K17,(D6)))","v":{"v":54.53972466916006,"d":"54.5"}},"kg",null,null,"Referring physician :"]
[{"$nulls":7},"Indication:"]
["Protocol :",{"$nulls":9},"Exercise stage:"]
[]
["Exercise parameters",{"$nulls":5},"Measured values",null,null,"Predicted values",null,null,"Z score"]
["Workload",null,null,"At VAT :",{"$nulls":3},"W","Predicted = ",null,{"$f":"IF($K$7=\"M\",Estimates_Male!B19,IF($K$7=\"F\",Estimates_Female!B19,\"sex?\"))","v":{"v":120.84331855009798,"d":"121"}},"W","Z = ",{"$f":"IF($K$7=\"M\",Estimates_Male!D19,IF($K$7=\"F\",Estimates_Female!D19,\"sexe\"))","v":" "},"  (",{"$f":"IF(N14= \" \",\" \",(IF((NORMSDIST(N14)*100)<1,\"< 1\",IF((NORMSDIST(N14)*100)>99,\">99\",NORMSDIST(N14)*100))))","v":" "},"th) perc."]
[{"$nulls":3},"At peak :",{"$nulls":3},"W","Predicted = ",null,{"$f":"IF($K$7=\"M\",Estimates_Male!B18,IF($K$7=\"F\",Estimates_Female!B18,\"sex?\"))","v":{"v":206.75084041064187,"d":"207"}},"W","Z = ",{"$f":"IF($K$7=\"M\",Estimates_Male!D18,IF($K$7=\"F\",Estimates_Female!D18,\"sexe\"))","v":" "},"  (",{"$f":"IF(N15= \" \",\" \",(IF((NORMSDIST(N15)*100)<1,\"< 1\",IF((NORMSDIST(N15)*100)>99,\">99\",NORMSDIST(N15)*100))))","v":" "},"th) perc."]
["VO2",null,null,"At VAT:",{"$nulls":3},"ml/min","Predicted = ",null,{"$f":"IF($K$7=\"M\",Estimates_Male!B6,IF($K$7=\"F\",Estimates_Female!B6,\"sex?\"))","v":{"v":1581.0950663951098,"d":"1581"}},"ml/min","Z = ",{"$f":"IF($K$7=\"M\",Estimates_Male!D6,IF($K$7=\"F\",Estimates_Female!D6,\"sexe\"))","v":" "},"  (",{"$f":"IF(N16= \" \",\" \",(IF((NORMSDIST(N16)*100)<1,\"< 1\",IF((NORMSDIST(N16)*100)>99,\">99\",NORMSDIST(N16)*100))))","v":" "},"th) perc."]
[{"$nulls":3},"At VAT:",null,null,{"$f":"G16/D6","v":{"v":0,"d":"0.0"}},"ml/kg/min"]
[{"$nulls":3},"At peak :",{"$nulls":3},"ml/min","Predicted = ",null,{"$f":"IF($K$7=\"M\",Estimates_Male!B5,IF($K$7=\"F\",Estimates_Female!B5,\"sex?\"))","v":{"v":2607.381381259105,"d":"2607"}},"ml/min","Z = ",{"$f":"IF($K$7=\"M\",Estimates_Male!D5,IF($K$7=\"F\",Estimates_Female!D5,\"sexe\"))","v":" "},"  (",{"$f":"IF(N18= \" \",\" \",(IF((NORMSDIST(N18)*100)<1,\"< 1\",IF((NORMSDIST(N18)*100)>99,\">99\",NORMSDIST(N18)*100))))","v":" "},"th) perc."]
[{"$nulls":3},"At peak :",null,null,{"$f":"G18/D6","v":{"v":0,"d":"0.0"}},"ml/kg/min"]
["Heart rate",null,null,"At rest :",{"$nulls":3},"BPM"]
{"$rows_left_out":19}
{"sheet":"Estimates_Male","index":1,"n_rows":22,"n_cols":13,"rows_kept":22}
["Body mass",{"$f":"rapport!D9","v":54.53972466916006},"age",{"$f":"rapport!K6","v":{"v":15,"d":"15.0"}}]
["Height",{"$f":"rapport!D5","v":155},"Sex",{"$f":"rapport!K7","v":"M"}]
[]
["Observed","Predicted","Predicted SD","Z","dependent_var","n_pt","intercept","multi1_beta","multi2_beta","multi3_beta","multi4_beta","std_intercept","std_slope"]
[{"$f":"rapport!G18","v":0},{"$f":"G5+(H5*$B$2*$B$2)+(I5*$B$2)+(J5*$B$1)+(K5*$D$1)","v":2607.381381259105},{"$f":"L5+(M5*$B$2)","v":282.62249999999995},{"$f":"IF(A5>0,(A5-B5)/C5,\" \")","v":" "},"peakvo2_avg30sec",109,-8660.14,-0.29714,105.875,36.5914,0,-717.05,6.4495]
[{"$f":"rapport!G16","v":0},1581.0950663951098,{"$f":"L6+(M6*$B$2)","v":390.46590000000003}," ","vo2_vat",107,-3897.72,-0.14561,56.265,17.9842,-48.3222,-90.93,3.10578]
[{"$f":"rapport!G31","v":0},11.029950000000001,{"$f":"L7+(M7*$B$2)","v":0.8693},{"$f":"IF(A7>0,(A7-B7)/C7,\" \")","v":" "},"vo2_work_slope",109,12.38,0,-0.00871,0,0,-1,0.01206]
[{"$f":"rapport!G25","v":0},13.880112996601001,{"$f":"L8+(M8*$B$2)","v":1.6266000000000007},{"$f":"IF(A8>0,(A8-B8)/C8,\" \")","v":" "},"o2p_peak_30sec",107,-37.48,-1.31E-3,0.459,0.2143,0,-2.67,0.02772]
[{"$f":"rapport!G27","v":{"v":0,"d":"0.000"}},0.0383,{"$f":"L9+(M9*$B$2)","v":0.00748}," ","o2p_work_slope",107,0.0383,0,0,0,0,0.00748,0]
[{"$f":"rapport!G26","v":0},133.15494497160245,{"$f":"L10+(M10*$B$2)","v":44.85640000000001}," ","o2p_inc_pct2",107,451.63,0.01393,-4.026,-0.5338,0,137.72,-0.59912]
[{"$f":"rapport!G35","v":0},2738.170642135755,292.11495000000014," ","OUES0_100",109,-4247.27,-0.17111,57.841,39.0725,0,-1042.48,8.61029]
[{"$f":"rapport!G36","v":0},{"$f":"G12+(H12*$B$2*$B$2)+(I12*$B$2)+(J12*$B$1)+(K12*$D$1)","v":2469.8339951473836},{"$f":"L12+(M12*$B$2)","v":343.21394999999995}," ","OUES0_VAT",107,3180.75,0.09235,-30.414,32.7201,0,-783.619,7.26989]
[{"$f":"rapport!G32","v":0},28.8046,3.6135500000000005,{"$f":"IF(A13>0,(A13-B13)/C13,\" \")","v":" "},"vevco2_slope0_100",107,35.11,0,-0.04068,0,0,4.48,-0.00559]
[{"$f":"rapport!G33","v":0},23.682448830417144,2.8699499999999993,{"$f":"IF(A14>0,(A14-B14)/C14,\" \")","v":" "},"vevco2_slope0_vat",107,7.87,-0.00092,0.319,-0.0466,-0.5992,11.04,-0.05271]
[{"$f":"rapport!G30","v":0},{"v":1.18806027533084,"d":"1.1880603"},0.0652,{"$f":"IF(A15>0,(A15-B15)/C15,\" \")","v":" "},"rer_avg30",109,0.79,0,1.42E-3,-1E-3,0.0155,0.09,-0.00016]
[{"$f":"rapport!G29","v":0},93.53120003811145,10.191600000000001," ","ve_avg30",109,2.7,0.00228,-0.419,0.9805,3.1682,-52.54,0.40472]
[{"$f":"rapport!G21","v":0},191.1005073382206,7.510750000000001,{"$f":"IF(A17>0,(A17-B17)/C17,\" \")","v":" "},"maxfcard",107,169.45,-0.00053,0.313,-0.2591,0,-7.47,0.09665]
[{"$f":"rapport!G15","v":0},206.75084041064187,26.4025,{"$f":"IF(A18>0,(A18-B18)/C18,\" \")","v":" "},"maxwork",109,378.86,0.01817,-5.324,2.8242,4.1697,-7.62,0.2195]
[{"$f":"rapport!G14","v":0},120.84331855009798,29.561449999999994,{"$f":"IF(A19>0,(A19-B19)/C19,\" \")","v":" "},"workload_vat",107,104.43,0.00386,-0.939,1.2692,0,-9.28,0.25059]
[{"$f":"rapport!G22","v":0},154.19217278763958,12.746649999999999,{"$f":"IF(A20>0,(A20-B20)/C20,\" \")","v":" "},"HRR1",89,536.44,0.01675,-4.908,-0.4387,0,12.68,0.00043]
{"$rows_left_out":3}
{"sheet":"Estimates_Female","index":2,"n_rows":22,"n_cols":13,"rows_kept":22}
["Body mass",{"$f":"rapport!D9","v":54.53972466916006},"age",{"$f":"rapport!K6","v":{"v":15,"d":"15.0"}}]
["Height",{"$f":"rapport!D5","v":155},"Sex",{"$f":"rapport!K7","v":"M"}]
[]
["Observed","Predicted","Predicted SD","Z","dependent_var","n_pt","intercept","multi1_beta","multi2_beta","multi3_beta","multi4_beta","std_intercept","std_slope"]
[{"$f":"rapport!G18","v":0},{"$f":"G5+(H5*$B$2*$B$2)+(I5*$B$2)+(J5*$B$1)+(K5*$D$1)","v":1968.3849996179283},{"$f":"L5+(M5*$B$2)","v":282.97709999999995},{"$f":"IF(A5>0,(A5-B5)/C5,\" \")","v":" "},"peakvo2_avg30sec",119,-6424.42,-0.24407,86.8042,14.7037,0,-45.905,2.12182]
[{"$f":"rapport!G16","v":0},1319.2700059268657,{"$f":"L6+(M6*$B$2)","v":285.6649},{"$f":"IF(A6>0,(A6-B6)/C6,\" \")","v":" "},"vo2_vat",118,1281.8,-0.00407,-2.1389,15.9084,-26.7239,215.329,0.45378]
[{"$f":"rapport!G31","v":0},10.257753814971242,{"$f":"L7+(M7*$B$2)","v":1.2001499999999998},{"$f":"IF(A7>0,(A7-B7)/C7,\" \")","v":" "},"vo2_work_slope",119,52.17,0.00145,-0.5005,0.0152,0,1.583,-2.47E-3]
[{"$f":"rapport!G25","v":0},10.660400274184418,1.677,{"$f":"IF(A8>0,(A8-B8)/C8,\" \")","v":" "},"o2p_peak_30sec",116,-1.83,-0.00019,0.0746,0.1007,0,2.173,-0.0032]
[{"$f":"rapport!G27","v":{"v":0,"d":"0.000"}},0.036502015264269286,0.007453999999999999,{"$f":"IF(A9>0,(A9-B9)/C9,\" \")","v":" "},"o2p_work_slope",119,0.05146,{"v":6.29e-07,"d":"0.000000629"},-2.32E-4,1.08E-4,0,0.01539,-5.12e-05]
[{"$f":"rapport!G26","v":0},115.266479845943,31.424800000000005," ","o2p_inc_pct2",116,-3002.23,-0.11372,38.1842,-0.29,-3.541,-47.402,0.50856]
[{"$f":"rapport!G35","v":0},2122.6690600709894,287.6054499999999," ","OUES0_100",119,-6768.43,-0.25095,91.4157,13.765,0,-406.049,4.47519]
[{"$f":"rapport!G36","v":0},2080.27748071541,319.26320000000004," ","OUES0_VAT",118,35.63,-0.03329,12.752,15.9128,0,-476.017,5.13084]
[{"$f":"rapport!G32","v":0},28.885168809440458,3.76795,{"$f":"IF(A13>0,(A13-B13)/C13,\" \")","v":" "},"vevco2_slope0_100",118,37.91,0.00019,-0.1122,0.0697,0,5.366,-0.01031]
[{"$f":"rapport!G33","v":0},25.00820874118094,2.73055,{"$f":"IF(A14>0,(A14-B14)/C14,\" \")","v":" "},"vevco2_slope0_vat",118,-120.73,-0.00558,1.8265,0.0191,-0.2901,1.985,4.81E-3]
[{"$f":"rapport!G30","v":0},{"v":1.2099745231285959,"d":"1.2099745"},0.08204999999999998,{"$f":"IF(A15>0,(A15-B15)/C15,\" \")","v":" "},"rer_avg30",119,0.91,0,0.00122,-1.9E-3,0.0143,0.251,-1.09E-3]
[{"$f":"rapport!G29","v":0},72.92867859778343,14.26575," ","ve_avg30",119,-202.86,-0.00697,2.564,0.5281,1.1347,3.718,0.06805]
[{"$f":"rapport!G21","v":0},190.58142519391814,9.694399999999998,{"$f":"IF(A17>0,(A17-B17)/C17,\" \")","v":" "},"maxfcard",116,-391.11,-0.02128,7.1975,-0.1932,-0.8088,28.406,-0.12072]
[{"$f":"rapport!G15","v":0},158.93123200738077,19.578650000000003,{"$f":"IF(A18>0,(A18-B18)/C18,\" \")","v":" "},"maxwork",119,-1622.29,-0.06025,20.5698,0.7409,0,-24.415,0.28383]
[{"$f":"rapport!G14","v":0},97.02857849863219,23.4896,{"$f":"IF(A19>0,(A19-B19)/C19,\" \")","v":" "},"workload_vat",118,-276.67,-0.01221,4.092,0.6011,0,17.767,0.03692]
[{"$f":"rapport!G22","v":0},167.0277829405495,15.20805," ","HRR1",100,144.81,0,0.22463,-0.047,-0.6691,60.017,-0.28909]
{"$rows_left_out":3}
{"sheet":"BFA_MaleCDC","index":3,"n_rows":2002,"n_cols":20,"rows_kept":2002}
["Age [y]","muHeight","sigmaHeight","muBMI","sigmaBMI","nuBMI","muWeight","sigmaWeight","nuWeight"]
[0,51.124584111251,1.917027938046,{"$nulls":3},3.617190132907,0.123616829932,0.847088610033]
[0.01,52.162623977143,1.893975522198,{"$nulls":3},3.738954059881,0.123195647923,0.835627289826]
[0.02,52.732638433264,1.883781649524,{"$nulls":3},3.861197210698,0.122776112305,0.824166675233,null,"BMI",{"$f":"rapport!D7","v":22.892819979188342}]
[0.03,53.235436535275,1.876605928396,{"$nulls":3},3.984372680405,0.122358427875,0.812707477745]
[0.04,53.712449352578,1.871298495569,{"$nulls":3},4.108894986554,0.121942797618,0.801250416239,null,"muBMI",{"$f":"IF(rapport!$K$7=\"M\", VLOOKUP(rapport!$K$6,male_table,4,FALSE), IF(rapport!$K$7=\"F\", VLOOKUP(rapport!$K$6,female_table,4,FALSE), \"out of range\"))","v":20.091094124572},null,"Z=x",{"$f":"((L4/L6)^L8-1)/(L7*L8)","v":0.8163368947338375},null,"Doit donner 64,6"]
[0.05,54.179464873262,1.867371097847,{"$nulls":3},4.235093266503,0.121529422242,0.789796219012,null,"sigmaBMI",{"$f":"IF(rapport!$K$7=\"m\", VLOOKUP(rapport!$K$6,male_table,5,FALSE), IF(rapport!$K$7=\"f\", VLOOKUP(rapport!$K$6,female_table,5,FALSE), \"out of range\"))","v":0.142647491687}]
[0.06,54.64377037606,1.864535310909,{"$nulls":3},4.363132350201,0.121118499965,0.778345636462,null,"nuBMI",{"$f":"IF(rapport!$K$7=\"m\", VLOOKUP(rapport!$K$6,male_table,6,FALSE), IF(rapport!$K$7=\"f\", VLOOKUP(rapport!$K$6,female_table,6,FALSE), \"out of range\"))","v":-1.785496644378}]
[0.07,55.108378946537,1.862595051573,{"$nulls":3},4.492990851867,0.120710222918,0.766899442585]
[0.08,55.572920828868,1.861406390199,{"$nulls":3},4.624402940238,0.120304778166,0.755458458458]
[0.09,56.035882856473,1.860867300793,{"$nulls":3},4.756829430843,0.119902355185,0.744023580866]
[0.1,56.495528168995,1.860888178302,{"$nulls":3},4.889488493855,0.119503145482,0.73259584223,{"$nulls":5},"exp ((log((l*s)+1) + (l * log(m)))/l)",{"$f":"EXP(LOG((L8*L7)+1)+(L8*LOG(L6))/L8)","v":{"v":3.239233346617639,"d":"3.23923"}}]
[0.11,56.949584170842,1.861387734815,{"$nulls":3},5.021427916402,0.119107340452,0.721176357553,{"$nulls":9},"Log((l*s+1))",{"$f":"(LOG((L8*L7)+1))","v":-0.12766690789194848}]
[0.12,57.396426896759,1.86229495281,{"$nulls":3},5.151752426425,0.118715128167,0.709766252512,{"$nulls":6},{"$f":"L6+T17","v":{"v":23.330327471189637,"d":"23.33033"}},null,null,"(l * log(m)))/l",{"$f":"(L8*LOG(L6))/L8","v":1.3030035882826139}]
[0.13,57.835645486609,1.863551320688,{"$nulls":3},5.27976643774,0.118326690477,0.69836664309,{"$nulls":6},{"$f":"rapport!D5/100*rapport!D5/100","v":{"v":2.4025,"d":"2.40"}},null,null,"Somme",{"$f":"T13+T14","v":1.1753366803906653}]
[0.14,58.267565430105,1.865106558018,{"$nulls":3},5.404980845581,0.117942198461,0.686978649478,{"$nulls":6},{"$f":"P14*P15+1","v":57.0511117495331}]
[0.15,58.692455937986,1.866921863458,{"$nulls":3},5.527117001486,0.117561808266,0.675603408398,{"$nulls":6},{"$f":"P14*P15","v":56.0511117495331},null,null,"exp(somme)",{"$f":"EXP(T15)","v":3.239233346617639}]
[0.16,59.110332920773,1.868965232329,{"$nulls":3},5.646058175201,0.11718566513,0.664242075733]
[0.17,59.521203708485,1.871213501355,{"$nulls":3},5.761737377706,0.116813907619,0.652895837566,{"$nulls":5},"Z (=1)=((bmi/m)**l-1)/(s*l);"]
[0.18,59.925130814217,1.873653889347,{"$nulls":3},5.874127622214,0.116446668114,0.641565900879]
{"$rows_left_out":1983}
{"sheet":"BFA_MaleWHO","index":4,"n_rows":339,"n_cols":15,"rows_kept":339}
["Age","L","M","S"]
[5.1,-0.7387,15.2641,0.0839]
[5.2,-0.7621,15.2616,0.08414]
[5.3,-0.7856,15.2604,0.08439,null,"BMI",{"$f":"rapport!D7","v":22.892819979188342}]
[5.3,-0.8089,15.2605,0.08464]
[5.4,-0.8322,15.2619,0.0849,null,"muBMI",{"$f":"IF(rapport!$K$7=\"M\", VLOOKUP(rapport!$K$6,BFA_MaleWHO,3,FALSE), IF(rapport!$K$7=\"F\", VLOOKUP(rapport!$K$6,BFA_FemaleWHO,3,FALSE), \"out of range\"))","v":19.7744},null,"Z=x",{"$f":"((G4/G6)^G8-1)/(G7*G8)","v":1.059494693022724}]
[5.5,-0.8554,15.2645,0.08516,null,"sigmaBMI",{"$f":"IF(rapport!$K$7=\"m\", VLOOKUP(rapport!$K$6,BFA_MaleWHO,4,FALSE), IF(rapport!$K$7=\"f\", VLOOKUP(rapport!$K$6,BFA_FemaleWHO,4,FALSE), \"out of range\"))","v":0.12412}]
[5.6,-0.8785,15.2684,0.08543,null,"nuBMI",{"$f":"IF(rapport!$K$7=\"m\", VLOOKUP(rapport!$K$6,BFA_MaleWHO,2,FALSE), IF(rapport!$K$7=\"f\", VLOOKUP(rapport!$K$6,BFA_FemaleWHO,2,FALSE), \"out of range\"))","v":-1.4961}]
[5.7,-0.9015,15.2737,0.0857]
[5.8,-0.9243,15.2801,0.08597]
[5.8,-0.9471,15.2877,0.08625]
[5.9,-0.9697,15.2965,0.08653,{"$nulls":5},"exp ((log((l*s)+1) + (l * log(m)))/l)",{"$f":"EXP(LOG((G8*G7)+1)+(G8*LOG(G6))/G8)","v":{"v":3.343071246268496,"d":"3.34307"}}]
[6,-0.9921,15.3062,0.08682,{"$nulls":9},"Log((l*s+1))",{"$f":"(LOG((G8*G7)+1))","v":-0.08921339560684427}]
[6.1,-1.0144,15.3169,0.08711,{"$nulls":6},{"$f":"G6+O17","v":{"v":23.117471246268497,"d":"23.11747"}},null,null,"(l * log(m)))/l",{"$f":"(G8*LOG(G6))/G8","v":1.2961033148932366}]
[6.2,-1.0365,15.3285,0.08741,{"$nulls":6},{"$f":"rapport!D5/100*rapport!D5/100","v":{"v":2.4025,"d":"2.40"}},null,null,"Somme",{"$f":"O13+O14","v":1.2068899192863922}]
[6.3,-1.0584,15.3408,0.08771,{"$nulls":6},{"$f":"K14*K15-1","v":54.53972466916006}]
[6.3,-1.0801,15.354,0.08802,{"$nulls":6},{"$f":"K14*K15","v":55.53972466916006},null,null,"exp(somme)",{"$f":"EXP(O15)","v":3.343071246268496}]
[6.4,-1.1017,15.3679,0.08833]
[6.5,-1.123,15.3825,0.08865,{"$nulls":5},"Z (=1)=((bmi/m)**l-1)/(s*l);"]
[6.6,-1.1441,15.3978,0.08898]
{"$rows_left_out":320}
{"sheet":"BFA_FemaleCDC","index":5,"n_rows":2002,"n_cols":9,"rows_kept":2002}
["Age [y]","muHeight","sigmaHeight","muBMI","sigmaBMI","nuBMI","muWeight","sigmaWeight","nuWeight"]
[0,50.334515447783,1.830170449531,{"$nulls":3},3.505892555091,0.120952785131,0.784619146749]
[0.01,51.366060186128,1.813423883883,{"$nulls":3},3.60913704712,0.120621434129,0.774473144139]
[0.02,51.906847636872,1.807001691829,{"$nulls":3},3.712703808913,0.120291208989,0.764327812098]
[0.03,52.38046277228,1.802960434276,{"$nulls":3},3.816903976111,0.119962323643,0.754183827974]
[0.04,52.826980148117,1.800400109075,{"$nulls":3},3.922020308869,0.119634990587,0.744041862692]
[0.05,53.260907816584,1.79893528562,{"$nulls":3},4.028291178037,0.119309422285,0.733902557016]
[0.06,53.688617444706,1.798330910137,{"$nulls":3},4.135817705266,0.118985827117,0.723766570856]
[0.07,54.114352546477,1.798416847215,{"$nulls":3},4.244577809621,0.11866440671,0.713634580363]
[0.08,54.539570993781,1.799065494533,{"$nulls":3},4.354427497218,0.118345356055,0.703507294912]
[0.09,54.963684937458,1.800193885799,{"$nulls":3},4.465015965501,0.118028866302,0.693385484629]
[0.1,55.384732799556,1.801728280016,{"$nulls":3},4.575767182045,0.117715120427,0.683269979955]
[0.11,55.800624036491,1.803618648973,{"$nulls":3},4.685933125442,0.11740429886,0.67316162619]
[0.12,56.210065094846,1.805828231496,{"$nulls":3},4.794806415713,0.117096580323,0.663061268919]
[0.13,56.612954262451,1.808323403965,{"$nulls":3},4.901887015475,0.116792140782,0.652969750767]
[0.14,57.009259825486,1.811067237231,{"$nulls":3},5.006910620925,0.116491144227,0.642887901842]
[0.15,57.399238834374,1.814022287615,{"$nulls":3},5.109809030912,0.116193735346,0.632816536535]
[0.16,57.782951399932,1.817157487739,{"$nulls":3},5.210611443878,0.115900046603,0.622756462621]
[0.17,58.16046100474,1.820453045092,{"$nulls":3},5.309362700663,0.115610200503,0.61270849903]
[0.18,58.53208271136,1.823895395994,{"$nulls":3},5.406104785169,0.115324302639,0.602673479442]
{"$rows_left_out":1983}
{"sheet":"BFA_FemaleWHO","index":6,"n_rows":170,"n_cols":4,"rows_kept":170}
["Age","L","M","S"]
[5.1,-0.8886,15.2441,0.09692]
[5.2,-0.9068,15.2434,0.09738]
[5.3,-0.9248,15.2433,0.09783]
[5.3,-0.9427,15.2438,0.09829]
[5.4,-0.9605,15.2448,0.09875]
[5.5,-0.978,15.2464,0.0992]
[5.6,-0.9954,15.2487,0.09966]
[5.7,-1.0126,15.2516,0.10012]
[5.8,-1.0296,15.2551,0.10058]
[5.8,-1.0464,15.2592,0.10104]
[5.9,-1.063,15.2641,0.10149]
[6,-1.0794,15.2697,0.10195]
[6.1,-1.0956,15.276,0.10241]
[6.2,-1.1115,15.2831,0.10287]
[6.3,-1.1272,15.2911,0.10333]
[6.3,-1.1427,15.2998,0.10379]
[6.4,-1.1579,15.3095,0.10425]
[6.5,-1.1728,15.32,0.10471]
[6.6,-1.1875,15.3314,0.10517]
{"$rows_left_out":150}