{"text_format":"2","workbook":"xlsx","n_sheets":2,"sheets":["Tracker","Journal Deadlines"],"not_rendered":{"charts":0,"images":0,"macros":0,"external_links":0,"defined_names":0,"comments":0,"pivot_tables":0},"unopened":[],"bounds":{"document_bytes":16777216,"sheet_cells":100000,"run_cost":"one","rows_first":2000,"rows_last":500,"rows_between":2000,"halvings":0,"cell_chars":16384,"cell_head_chars":4096},"cells_cut":0,"cells_raw":0,"read":"whole","date_system":"1900"}

{"sheet":"Tracker","index":0,"n_rows":68,"n_cols":47,"rows_kept":68,"cut":false,"hidden":false,"merged":[]}
[null,"Week beginning","Journal Name","Trial Title","Publication Date","Link to online trial report","Link to online registry entry for trial","Pre-specified outcomes obtained from protocol or registry entry?","Initial assessor Name","Assigned date","Completion date","Link to Assessment","Second assessor name","[S] Total number of prespecified PRIMARY outcomes","[S] Number of prespecified PRIMARY outcomes correctly reported","[S] Number of prespecified PRIMARY outcomes incorrectly reported ","[S] Number of prespecified PRIMARY outcomes not reported in publication","[S] Number of PRIMARY outcomes insufficiently prespecified","[S] Total number of prespecified SECONDARY outcomes","[S] Number of prespecified SECONDARY outcomes correctly reported","[S] Number of prespecified SECONDARY outcomes incorrectly reported ","[S] Number of SECONDARY outcomes not reported in publication","[S] Number of SECONDARY outcomes insufficiently prespecified","[S] Total number of NON-PRESPECIFIED outcomes reported","[S] Number of NON-PRESPECIFIED outcomes correctly declared","Total number of prespecified PRIMARY outcomes","Number of prespecified PRIMARY outcomes correctly reported","Number of prespecified PRIMARY outcomes incorrectly reported ","Number of prespecified PRIMARY outcomes not reported in publication","Number of PRIMARY outcomes insufficiently prespecified","Total number of prespecified SECONDARY outcomes","Number of prespecified SECONDARY outcomes correctly reported","Number of prespecified SECONDARY outcomes incorrectly reported ","Number of SECONDARY outcomes not reported in publication","Number of SECONDARY outcomes insufficiently prespecified","Total number of NON-PRESPECIFIED outcomes reported","Number of NON-PRESPECIFIED outcomes correctly declared","First Assessor Opinion - Letter required?","Second Assessor Opinion - Letter Required?","Final Decision - Letter Required?","Link to letter ","Letter checked by BG, CH or KM - initial and date","Letter Submission Deadline","Letter sent date","Letter Status","Letter published?","Letter published date"]
[1.0,"2015-10-19","NEJM","A Randomized, Controlled Trial of Total Knee Replacement","2015-10-22","http://www.nejm.org/doi/full/10.1056/NEJMoa1505467","https://clinicaltrials.gov/ct2/show/record/NCT01410409","Registry Entry","Henry Drysdale","2015-10-25","2015-10-28","https://docs.google.com/spreadsheets/d/1BISudLrrwteQ47v9ELbRPZ0dq7wwlPn1WNwVrW_FBFU/edit#gid=0","Aaron Dale",1.0,1.0,0.0,0.0,0.0,6.0,4.0,0.0,2.0,0.0,6.0,0.0,1.0,1.0,0.0,0.0,0.0,6.0,4.0,0.0,2.0,0.0,6.0,0.0,"Yes","Not Sure","Yes","https://docs.google.com/document/d/17fBfLC3QTdt617VsThn_ZD5onE9tlQHhsfeM4Kj_zTI/edit#heading=h.ftf9zx7bu9si","BG 4th nov 2015",{"$f":"if($C2 = \"BMJ\", \"BMJ\", E2+VLOOKUP($C2,'Journal Deadlines'!$A$2:$B$5,2,FALSE))","v":"2015-11-12"},"2015-11-04","Letter rejected by editor","No"]
[2.0,null,"NEJM","A Phase 3 Randomized Trial of Nicotinamide for Skin-Cancer Chemoprevention","2015-10-22","http://www.nejm.org/doi/full/10.1056/NEJMoa1506197","https://www.anzctr.org.au/Trial/Registration/TrialReview.aspx?ACTRN=12612000625875","Protocol","Henry Drysdale","2015-10-25","2015-10-28","https://docs.google.com/spreadsheets/d/1EhiJbn-WBdiFiLckQQrEG0IpCERgr4E4bEEIdPGixuE/edit#gid=0","Aaron Dale",1.0,1.0,0.0,0.0,0.0,22.0,7.0,0.0,12.0,3.0,0.0,0.0,1.0,1.0,0.0,0.0,0.0,11.0,4.0,0.0,4.0,3.0,0.0,0.0,"Yes","Yes","Yes","https://docs.google.com/document/d/1SbTbq13wd79ImPBThv8r2dk91Ok6Ik6uVBfzbGEPErI/edit","BG 4th nov 2015",{"$f":"if($C3 = \"BMJ\", \"BMJ\", E3+VLOOKUP($C3,'Journal Deadlines'!$A$2:$B$5,2,FALSE))","v":"2015-11-12"},"2015-11-05","Letter rejected by editor","No"]
[3.0,null,"NEJM","Nivolumab versus Docetaxel in Advanced Nonsquamous Non–Small-Cell Lung Cancer","2015-10-22","http://www.nejm.org/doi/full/10.1056/NEJMoa1507643","https://clinicaltrials.gov/archive/NCT01673867/2012_10_24","Protocol","Philip Hartley","2015-10-25","2015-10-28","https://docs.google.com/spreadsheets/d/148aDkt-JstDnGBhqNdTZp8fPWCkRbLRsi4BRqlbu76g/edit#gid=0","Ioan Milosevic",1.0,1.0,0.0,0.0,0.0,4.0,2.0,0.0,1.0,1.0,0.0,0.0,1.0,1.0,0.0,0.0,0.0,4.0,2.0,0.0,1.0,1.0,0.0,0.0,"Not sure","Yes","Yes","https://docs.google.com/document/d/1WLkieTOMeNYybLuJT3mHNkp-aTiLX8Kb06ENe0xPymM/edit#","BG 4th nov 2015",{"$f":"if($C4 = \"BMJ\", \"BMJ\", E4+VLOOKUP($C4,'Journal Deadlines'!$A$2:$B$5,2,FALSE))","v":"2015-11-12"},"2015-11-05","Letter rejected by editor","No"]
[4.0,null,"JAMA","Naproxen With Cyclobenzaprine, Oxycodone/Acetaminophen, or Placebo for Treating Acute Low Back Pain","2015-10-20","http://jama.jamanetwork.com/article.aspx?articleid=2463257","https://clinicaltrials.gov/show/NCT01587274","Registry Entry","Ioan Milosevic","2015-10-25","2015-10-27","https://docs.google.com/spreadsheets/d/1SGn7DA_4c4roEBfIGywmTx1V4FGfzpC0D5CdxGfNP0Q/edit#gid=0","Eirion Slade",1.0,1.0,0.0,0.0,0.0,0.0,0.0,0.0,0.0,0.0,5.0,5.0,1.0,1.0,0.0,0.0,0.0,0.0,0.0,0.0,0.0,0.0,5.0,5.0,"No","No","No",null,"Letter not required",{"$f":"if($C5 = \"BMJ\", \"BMJ\", E5+VLOOKUP($C5,'Journal Deadlines'!$A$2:$B$5,2,FALSE))","v":"2015-11-17"},"Not required","Letter not required","Letter not required"]
[5.0,null,"Ann Intern Med.","Effects of Initiating Moderate Alcohol Intake on Cardiometabolic Risk in Adults With Type 2 Diabetes: A 2-Year Randomized, Controlled Trial","2015-10-20","http://annals.org/article.aspx?articleid=2456121","https://clinicaltrials.gov/ct2/show/NCT00784433?term=cascade+alcohol&rank=1","Registry Entry","Eirion Slade","2015-10-25","2015-10-27","https://docs.google.com/spreadsheets/d/1qftvTP-4JrI1SxV7cu6588_kiwICY7bolwP6L4vlWWI/edit","Henry Drysdale",1.0,0.0,1.0,0.0,1.0,1.0,0.0,0.0,0.0,1.0,14.0,0.0,1.0,0.0,1.0,0.0,1.0,1.0,0.0,0.0,0.0,1.0,14.0,0.0,"Yes","Yes","Yes","https://docs.google.com/document/d/13rfaG2bfiOftob9XfnsT2SNycMGP1KonOqWslmfibRA/edit","BG 4th nov 2015",{"$f":"if($C6 = \"BMJ\", \"BMJ\", E6+VLOOKUP($C6,'Journal Deadlines'!$A$2:$B$5,2,FALSE))","v":"2015-11-17"},"2015-11-09","Letter published","Yes","2015-11-09"]
[6.0,null,"Lancet","5-year results of accelerated partial breast irradiation using sole interstitial multicatheter brachytherapy versus whole-breast irradiation with boost after breast-conserving surgery for low-risk invasive and in-situ carcinoma of the female breast: a randomised, phase 3, non-inferiority trial","2015-10-20","http://www.thelancet.com/journals/lancet/article/PIIS0140-6736(15)00471-7/abstract","https://clinicaltrials.gov/ct2/show/study/NCT00402519","Registry Entry","Aaron Dale","2015-10-25","2015-10-27","https://docs.google.com/spreadsheets/d/1q8SkvpcAbwiw38vKK5mumvT2HQXdNysLHpkhDtxvu_k/edit#gid=0","Philip Hartley",1.0,1.0,0.0,0.0,0.0,3.0,3.0,0.0,0.0,0.0,2.0,0.0,1.0,1.0,0.0,0.0,0.0,3.0,3.0,0.0,0.0,0.0,2.0,0.0,"Yes","Not Sure","No",null,"Letter not required (BG 6th nov 2015)",{"$f":"if($C7 = \"BMJ\", \"BMJ\", E7+VLOOKUP($C7,'Journal Deadlines'!$A$2:$B$5,2,FALSE))","v":"2015-11-03"},"Not required","Letter not required","Letter not required"]
[7.0,null,"Lancet","An internet-delivered handwashing intervention to modify influenza-like illness and respiratory infection transmission (PRIMIT): a primary care randomised trial","2015-10-24","http://www.thelancet.com/journals/lancet/article/PIIS0140-6736(15)60127-1/abstract","http://www.controlled-trials.com/ISRCTN75058295","Registry Entry","Aaron Dale","2015-10-25","2015-10-28","https://docs.google.com/spreadsheets/d/1cQ0Rd8vtTxtxcp5dFHp1j67vW6XErsPG9H2hCBFwiJE/edit","Philip Hartley",6.0,0.0,0.0,4.0,2.0,6.0,0.0,0.0,6.0,0.0,17.0,0.0,6.0,0.0,0.0,4.0,2.0,6.0,0.0,0.0,6.0,0.0,15.0,0.0,"Yes","Yes","Yes","https://docs.google.com/document/d/1j0XwuqGWecGeIC1JrLyNh6FiWB7eO1G-6WTVLFBq5rw/edit#","BG CH 6th nov 2015",{"$f":"if($C8 = \"BMJ\", \"BMJ\", E8+VLOOKUP($C8,'Journal Deadlines'!$A$2:$B$5,2,FALSE))","v":"2015-11-07"},"2015-11-06","Letter published","Yes","2016-01-23"]
[8.0,null,"Lancet","Percutaneous tibial nerve stimulation versus sham electrical stimulation for the treatment of faecal incontinence in adults (CONFIDeNT): a double-blind, multicentre, pragmatic, parallel-group, randomised controlled trial","2015-10-24","http://www.thelancet.com/journals/lancet/article/PIIS0140-6736(15)60314-2/abstract","http://www.isrctn.com/ISRCTN88559475","Registry Entry","Philip Hartley","2015-10-25","2015-10-29","https://docs.google.com/spreadsheets/d/1AOSJC94p4UorJKWSg_pzumr8l7DVqyAMaGBfHXhNXx0/edit","Ioan Milosevic",1.0,1.0,0.0,0.0,0.0,10.0,8.0,0.0,2.0,7.0,3.0,0.0,1.0,1.0,0.0,0.0,0.0,10.0,8.0,0.0,2.0,7.0,3.0,0.0,"Yes","Yes","Yes","https://docs.google.com/document/d/1Ue6LTE2QanundimVXG-N7zJMH-kcc_b_9FU6NAbsX4U/edit#heading=h.squyjmyz1v2d","BG 6th nov 2015",{"$f":"if($C9 = \"BMJ\", \"BMJ\", E9+VLOOKUP($C9,'Journal Deadlines'!$A$2:$B$5,2,FALSE))","v":"2015-11-07"},"2015-11-06","Letter published","Yes","2016-02-13"]
[9.0,null,"Lancet","Eltrombopag for children with chronic immune thrombocytopenia (PETIT2): a randomised, multicentre, placebo-controlled trial","2015-10-24","http://www.thelancet.com/journals/lancet/article/PIIS0140-6736(15)61107-2/abstract","https://clinicaltrials.gov/archive/NCT01520909/2012_03_09","Registry Entry","Ioan Milosevic","2015-10-25","2015-10-29","https://docs.google.com/spreadsheets/d/1KNGgHyhtpJxTfDhbIheP8r4k_arybAJLwJmshrthd8M/edit#gid=0","Eirion Slade",1.0,1.0,0.0,0.0,0.0,22.0,11.0,1.0,8.0,3.0,1.0,0.0,1.0,1.0,0.0,0.0,0.0,18.0,7.0,1.0,8.0,3.0,1.0,0.0,"Yes","Yes","Yes","https://docs.google.com/document/d/1KDzNEukAysEj-sPFd1Tvuq15_EW7fH4IaA_7SAy9tRw/edit#heading=h.gpply6u8p5l6","BG 6th nov 2015",{"$f":"if($C10 = \"BMJ\", \"BMJ\", E10+VLOOKUP($C10,'Journal Deadlines'!$A$2:$B$5,2,FALSE))","v":"2015-11-07"},"2015-11-06","Letter published","Yes","2016-01-23"]
[10.0,null,"Lancet","Neurodevelopmental outcome at 2 years of age after GA or awake-regional anaesthesia in infancy (GAS)","2015-11-04","http://www.thelancet.com/journals/lancet/article/PIIS0140-6736(15)00608-X/fulltext","https://clinicaltrials.gov/ct2/show/NCT00756600?term=NCT00756600.&rank=1","Registry Entry","Eirion Slade","2015-10-25","2015-11-14","https://docs.google.com/spreadsheets/d/1Dbt4whQhiBNHQx4s1CWhBCS3_Jlp1t1yXJJBDXxbf78/edit#gid=0","Henry Drysdale",0.0,0.0,0.0,0.0,0.0,3.0,0.0,0.0,0.0,0.0,26.0,0.0,0.0,0.0,0.0,0.0,0.0,3.0,0.0,0.0,0.0,0.0,26.0,0.0,"Yes","Yes","Yes","https://docs.google.com/document/d/1YF0ASzF_C5PFY4NJiGlzqrSIfK5ZcV0NGBCi9NU0JMQ/edit#heading=h.frtbs8xgpuxh","CH 17/11",{"$f":"if($C11 = \"BMJ\", \"BMJ\", E11+VLOOKUP($C11,'Journal Deadlines'!$A$2:$B$5,2,FALSE))","v":"2015-11-18"},"2015-11-17","Letter published","Yes","2016-04-16"]
[13.0,"2015-10-26","NEJM","Paclitaxel-Eluting versus Everolimus-Eluting Coronary Stents in Diabetes","2015-10-29","http://www.nejm.org/doi/full/10.1056/NEJMoa1510188","http://ctri.nic.in/Clinicaltrials/advsearch.php","Protocol","Philip Hartley","2015-10-30","2015-11-01","https://docs.google.com/spreadsheets/d/1jY791XpQqpvt-zxyPfHsJGISJD9syz6zQXP8sJGriTg/edit#gid=0","Ioan Milosevic",1.0,1.0,0.0,0.0,0.0,15.0,14.0,0.0,1.0,0.0,4.0,0.0,1.0,1.0,0.0,0.0,0.0,15.0,14.0,0.0,1.0,0.0,4.0,0.0,"Yes","Yes","Yes","https://docs.google.com/document/d/1xv_ekMivMTRBwGBmVRTCzSK5H8ZlkXnaMBzV6R6hflM/edit","BG 12th nov 2015",{"$f":"if($C12 = \"BMJ\", \"BMJ\", E12+VLOOKUP($C12,'Journal Deadlines'!$A$2:$B$5,2,FALSE))","v":"2015-11-19"},"2015-11-07","Letter rejected by editor","No"]
[14.0,null,"JAMA","Effect of a Buffered Crystalloid Solution vs Saline on Acute Kidney Injury Among Patients in the Intensive Care UnitThe SPLIT Randomized Clinical Trial","2015-10-27","http://jama.jamanetwork.com/article.aspx?articleid=2454911","http://www.anzctr.org.au/trial_view.aspx?ACTRN=ACTRN12613001370796","Protocol","Ioan Milosevic","2015-10-30","2015-11-02","https://drive.google.com/open?id=13tGwajYMRg0cxCZvHnMfsWT4HTvo1fNzvFOgp5fQhpI","Henry Drysdale",1.0,1.0,0.0,0.0,0.0,12.0,12.0,0.0,0.0,0.0,1.0,0.0,1.0,1.0,0.0,0.0,0.0,12.0,12.0,0.0,0.0,0.0,1.0,0.0,"No","No","No",null,"Letter not required",{"$f":"if($C13 = \"BMJ\", \"BMJ\", E13+VLOOKUP($C13,'Journal Deadlines'!$A$2:$B$5,2,FALSE))","v":"2015-11-24"},"Not required","Letter not required","Letter not required"]
[15.0,null,"JAMA","Effect of Noninvasive Ventilation vs Oxygen Therapy on Mortality Among Immunocompromised Patients With Acute Respiratory FailureA Randomized Clinical Trial","2015-10-27","http://jama.jamanetwork.com/article.aspx?articleid=2454912","http://clinicaltrials.gov/show/NCT01915719","Protocol","Ioan Milosevic","2015-10-30","2015-11-02","https://drive.google.com/open?id=1M8br026UdJ4PXWbwIrbKdemngdZqMDpmEMnfWcpG3Dc","Henry Drysdale",1.0,1.0,0.0,0.0,0.0,6.0,5.0,0.0,1.0,0.0,3.0,1.0,1.0,1.0,0.0,0.0,0.0,6.0,5.0,0.0,1.0,0.0,3.0,1.0,"Not sure","Not Sure","Yes","https://docs.google.com/document/d/1-ZCMqgiqTtHDrOMQps85z-nCrXAzFuARrZ_TDcekJf0/edit#","BG Nov 12 2015",{"$f":"if($C14 = \"BMJ\", \"BMJ\", E14+VLOOKUP($C14,'Journal Deadlines'!$A$2:$B$5,2,FALSE))","v":"2015-11-24"},"2015-11-12","Letter rejected by editor","No"]
[16.0,null,"JAMA","Anticholinergic vs Long-Acting β-Agonist in Combination With Inhaled Corticosteroids in Black Adults With Asthma The BELT Randomized Clinical Trial","2015-10-27","http://jama.jamanetwork.com/article.aspx?articleid=2466145","https://clinicaltrials.gov/show/NCT01290874","Registry Entry","Ioan Milosevic","2015-10-30","2015-11-04","https://drive.google.com/open?id=1YpDi1uc8R1Y94mW1mY9J_imLFM8TPTvmuCd0yadpdTc","Aaron Dale",1.0,1.0,0.0,0.0,0.0,10.0,10.0,0.0,0.0,0.0,2.0,0.0,1.0,1.0,0.0,0.0,0.0,7.0,7.0,0.0,0.0,0.0,2.0,0.0,"Yes","Yes","Yes","https://docs.google.com/document/d/1MqzBLKUoPdrwfd3nh40cjhUpMCaQDyOap69R23VhjAY/edit#","BG Nov 12 2015 ",{"$f":"if($C15 = \"BMJ\", \"BMJ\", E15+VLOOKUP($C15,'Journal Deadlines'!$A$2:$B$5,2,FALSE))","v":"2015-11-24"},"2015-11-12","Letter rejected by editor","No"]
[17.0,null,"Lancet","Clinical outcomes in patients with ST-segment elevation myocardial infarction treated with everolimus-eluting stents versus bare-metal stents (EXAMINATION): 5-year results of a randomised trial","2015-10-28","http://www.thelancet.com/journals/lancet/article/PIIS0140-6736(15)00548-6/abstract","https://clinicaltrials.gov/show/NCT00828087","Registry Entry","Henry Drysdale","2015-10-30","2015-11-03","https://docs.google.com/spreadsheets/d/1lDT0Pchhcoa4U_Y5wFjdd54cv4eGuIijfYEekIsqCbY/edit#gid=0","Philip Hartley",1.0,1.0,0.0,0.0,0.0,32.0,25.0,0.0,5.0,0.0,11.0,0.0,1.0,1.0,0.0,0.0,0.0,6.0,5.0,0.0,1.0,0.0,46.0,0.0,"Yes","Yes","Yes","https://docs.google.com/document/d/1qpTABuRcz8pNpgscmNT4hyM9ZPde-d3qpsiXE1qwwWY/edit#heading=h.p0rbmhgsvknf","BG 9th Nov 2015",{"$f":"if($C16 = \"BMJ\", \"BMJ\", E16+VLOOKUP($C16,'Journal Deadlines'!$A$2:$B$5,2,FALSE))","v":"2015-11-11"},"2015-11-09","Letter published","Yes","2016-05-14"]
[18.0,null,"Lancet","Postural modification to the standard Valsalva manoeuvre for emergency treatment of supraventricular tachycardias (REVERT): a randomised controlled trial","2015-10-31","http://www.thelancet.com/journals/lancet/article/PIIS0140-6736(15)61485-4/abstract","http://www.isrctn.com/ISRCTN67937027","Registry Entry","Aaron Dale","2015-10-30","2015-11-03","https://docs.google.com/spreadsheets/d/1H0-ymJJEE4sCJlV1Av8VCvKmdipczLIUhcnov0urUBk/edit#gid=0","Ioan Milosevic",1.0,1.0,0.0,0.0,0.0,4.0,4.0,0.0,0.0,0.0,1.0,0.0,1.0,1.0,0.0,0.0,0.0,4.0,4.0,0.0,0.0,0.0,1.0,0.0,"Yes","Yes","Yes","https://docs.google.com/document/d/1ZkPcuVrbxDFRh__wBiygD4JGfNabjyL_6BWlnu4Gz_s/edit#heading=h.c7rvw5m9uatb","BG 9th Nov 2015",{"$f":"if($C17 = \"BMJ\", \"BMJ\", E17+VLOOKUP($C17,'Journal Deadlines'!$A$2:$B$5,2,FALSE))","v":"2015-11-14"},"2015-11-10","Letter rejected by editor","No"]
[20.0,null,"BMJ","Liraglutide in people treated for type 2 diabetes with multiple daily insulin injections: randomised clinical trial (MDI Liraglutide trial)","2015-10-28","http://www.bmj.com/content/351/bmj.h5364","https://www.clinicaltrialsregister.eu/ctr-search/trial/2012-001941-42/SE","Registry Entry","Ioan Milosevic","2015-10-30","2015-11-05","https://drive.google.com/open?id=1KzdSAuo2ENMQvIIeMrU8Cpe17tB1Blc7-wjMesSlkLM","Aaron Dale",1.0,1.0,0.0,0.0,0.0,18.0,18.0,0.0,0.0,0.0,0.0,0.0,1.0,1.0,0.0,0.0,0.0,18.0,18.0,0.0,0.0,0.0,0.0,0.0,"No","No","No",null,"Letter not required",{"$f":"if($C18 = \"BMJ\", \"BMJ\", E18+VLOOKUP($C18,'Journal Deadlines'!$A$2:$B$5,2,FALSE))","v":"BMJ"},"Not required","Letter not required","Letter not required"]
[22.0,"2015-11-02","NEJM","Cabozantinib versus Everolimus in Advanced Renal-Cell Carcinoma","2015-11-05","http://www.nejm.org/doi/full/10.1056/NEJMoa1510016","https://clinicaltrials.gov/ct2/show/NCT01865747?term=NCT01865747&rank=1","Protocol","Philip Hartley","2015-11-06","2015-11-15","https://docs.google.com/spreadsheets/d/1TCRUUZO5jSm0IVEklPkNPjKkYkDMUtp47j7C0NUxPBE/edit#gid=0","Henry Drysdale",1.0,1.0,0.0,0.0,0.0,15.0,3.0,0.0,null,8.0,0.0,0.0,1.0,1.0,0.0,0.0,0.0,15.0,3.0,0.0,null,8.0,0.0,0.0,"No","Yes","Yes","https://docs.google.com/document/d/1EhdmLDe0Hzy_tOdc5zsJmnEO1-0DMQN_Mls_0IsUjkk/edit#heading=h.7jj9xqn5vcae","BG 23 nov 15 ",{"$f":"if($C19 = \"BMJ\", \"BMJ\", E19+VLOOKUP($C19,'Journal Deadlines'!$A$2:$B$5,2,FALSE))","v":"2015-11-26"},"2015-11-23","Letter rejected by editor","No"]
[23.0,null,"NEJM","Nivolumab versus Everolimus in Advanced Renal-Cell Carcinoma","2015-11-05","http://www.nejm.org/doi/full/10.1056/NEJMoa1510665","https://clinicaltrials.gov/show/NCT01668784","Protocol","Henry Drysdale","2015-11-06","2015-11-11","https://docs.google.com/spreadsheets/d/1P2zM4DRXAmWl_RLJs5PpxsTe2CkWSqE1vdPPNnmEWco/edit#gid=0","Ioan Milosevic",1.0,1.0,0.0,0.0,1.0,7.0,5.0,0.0,null,6.0,3.0,1.0,1.0,1.0,0.0,0.0,1.0,7.0,5.0,0.0,null,6.0,3.0,1.0,"Yes","Yes","Yes","https://docs.google.com/document/d/1Acce3W2luRBJ8ZU82-YiMvGAOvmz2pOJCprCQ8bKj94/edit#heading=h.8fdur5dkv75s","KM 18/11",{"$f":"if($C20 = \"BMJ\", \"BMJ\", E20+VLOOKUP($C20,'Journal Deadlines'!$A$2:$B$5,2,FALSE))","v":"2015-11-26"},"2015-11-23","Letter rejected by editor","No"]
{"$rows_left_out":49}
{"sheet":"Journal Deadlines","index":1,"n_rows":5,"n_cols":2,"rows_kept":5,"cut":false,"hidden":false,"merged":[]}
["Journal Name","Letter Submission deadline (days)"]
["NEJM",21.0]
["JAMA",28.0]
["Ann Intern Med.",28.0]
["Lancet",14.0]